Organisation Name,NACS Code,Organisation Type,Address1,Address2,Address3,Address4,Address5,PostCode,Telephone Number,NHS.UK users rating,Value  (NHS.UK users rating),Banding Classification  (NHS.UK users rating),Car parking (Is there car parking at this organisation?),Disabled access (Disabled access)
Whitegates Respite,1-13413894661,SCL,White Gates,Sparken Hill,,Worksop,,S80 1AP,,No ratings yet Rate it yourself - /Services/careproviders/LeaveReview/DefaultView.aspx?id=1-13413894661,0,0,,
Westwood,1-390701793,SCL,Talbot Road,,,Worksop,Nottinghamshire,S80 2PG,Tel: 01909533690,1 rating Rate it yourself - /Services/careproviders/LeaveReview/DefaultView.aspx?id=1-390701793,,,,
Mencap North Notts Services,1-119189009,SCL,Dukeries Business Centre,31-33 Retford Road,,Worksop,Nottinghamshire,S80 2PU,Tel: 01909712255,No ratings yet Rate it yourself - /Services/careproviders/LeaveReview/DefaultView.aspx?id=1-119189009,0,0,,
Holy Spirit Home Care,1-7174011695,SCL,47 Retford Road,,,Worksop,,S80 2PU,Tel: 01909489489,No ratings yet Rate it yourself - /Services/careproviders/LeaveReview/DefaultView.aspx?id=1-7174011695,0,0,,
Sherwood Prime Care Ltd,1-769399106,SCL,,31-33 Retford Road,,Worksop,Nottinghamshire,S80 2PU,Tel: 01909 712271,No ratings yet Rate it yourself - /Services/careproviders/LeaveReview/DefaultView.aspx?id=1-769399106,0,0,,
Holles Street Short Breaks Service,1-160561344,SCL,Holles Street,,,Worksop,Nottinghamshire,S80 2LJ,Tel: 01909535220,No ratings yet Rate it yourself - /Services/careproviders/LeaveReview/DefaultView.aspx?id=1-160561344,0,0,,
Comfort Call (Priory Court),1-7202547435,SCL,Priory Court,Thurstan Way,,Worksop,,S80 2TJ,Tel: 01909482156,No ratings yet Rate it yourself - /Services/careproviders/LeaveReview/DefaultView.aspx?id=1-7202547435,0,0,,
Charlesworth 247 Limited,1-188097964,SCL,46 Park Street,,,Worksop,Nottinghamshire,S80 1HF,Tel: 01909476722,No ratings yet Rate it yourself - /Services/careproviders/LeaveReview/DefaultView.aspx?id=1-188097964,0,0,,
Leda Homecare Ltd,1-616510538,SCL,Carriage Court,Welbeck,,Worksop,Nottinghamshire,S80 3LR,Tel: 01909 512550,No ratings yet Rate it yourself - /Services/careproviders/LeaveReview/DefaultView.aspx?id=1-616510538,0,0,,
Victoria Care Home,1-112566796,SCL,Memorial Avenue,,,Worksop,Nottinghamshire,S80 2BJ,Tel: 01909476416,No ratings yet Rate it yourself - /Services/careproviders/LeaveReview/DefaultView.aspx?id=1-112566796,0,0,,
Mayfair Care Home,1-16373139865,SCL,1-10 Mayfair Row,,,Worksop,,S80 1FA,Tel: 01158223000,No ratings yet Rate it yourself - /Services/careproviders/LeaveReview/DefaultView.aspx?id=1-16373139865,0,0,,
Hallam24 Bassetlaw,1-9970761703,SCL,7 Ryton Street,,,Worksop,,S80 2AY,Tel: 01909479951,No ratings yet Rate it yourself - /Services/careproviders/LeaveReview/DefaultView.aspx?id=1-9970761703,0,0,,
React Homecare Ltd,1-5683600275,SCL,2 Hardy Street,,,Worksop,Nottinghamshire,S80 1EH,Tel: 01909261221,No ratings yet Rate it yourself - /Services/careproviders/LeaveReview/DefaultView.aspx?id=1-5683600275,0,0,,
Old Vicarage Care Home,1-9905955514,SCL,Newcastle Avenue,,,Worksop,Nottinghamshire,S80 1NJ,Tel: 01909475521,No ratings yet Rate it yourself - /Services/careproviders/LeaveReview/DefaultView.aspx?id=1-9905955514,0,0,,
Worksop Supported Living Service,1-10631963207,SCL,Apartement 1 Old Bakery Yard,Newcastle Avenue,,Worksop,,S80 1NS,Tel: 07483087714,No ratings yet Rate it yourself - /Services/careproviders/LeaveReview/DefaultView.aspx?id=1-10631963207,0,0,,
Nightingale Nursing and Care Home,1-8417661855,SCL,Fourth Avenue,Edwinstowe,,Mansfield,Nottinghamshire,NG21 9PA,Tel: 01623824480,No ratings yet Rate it yourself - /Services/careproviders/LeaveReview/DefaultView.aspx?id=1-8417661855,0,0,,
Heslop Court,1-16373139959,SCL,1 Heslop Court,,,Worksop,,S80 1YH,Tel: 01158223000,No ratings yet Rate it yourself - /Services/careproviders/LeaveReview/DefaultView.aspx?id=1-16373139959,0,0,,
Sherwood Grange Care Centre,1-9634226858,SCL,208 Mansfield Road,Edwinstowe,,Mansfield,Nottinghamshire,NG21 9HF,Tel: 01623824054,No ratings yet Rate it yourself - /Services/careproviders/LeaveReview/DefaultView.aspx?id=1-9634226858,0,0,,
Comfort Call (Worksop),1-2086449351,SCL,115 Gateford Road,,,Worksop,Nottinghamshire,S80 1UD,Tel: 01909470685,No ratings yet Rate it yourself - /Services/careproviders/LeaveReview/DefaultView.aspx?id=1-2086449351,0,0,,
Carlton Road,1-128953055,SCL,181-183 Carlton Road,,,Worksop,Nottinghamshire,S81 7AD,Tel: 01909473831,No ratings yet Rate it yourself - /Services/careproviders/LeaveReview/DefaultView.aspx?id=1-128953055,0,0,,
23 Church Street,1-129459266,SCL,Market Warsop,,,Mansfield,Nottinghamshire,NG20 0AU,Tel: 01623840000,No ratings yet Rate it yourself - /Services/careproviders/LeaveReview/DefaultView.aspx?id=1-129459266,0,0,,
Worksop Home,1-16373139902,SCL,40 Holding,,,Worksop,,S81 0TD,Tel: 01158223000,No ratings yet Rate it yourself - /Services/careproviders/LeaveReview/DefaultView.aspx?id=1-16373139902,0,0,,
Care Driven Agency,1-8857074733,SCL,38 Harstoft Avenue,,,Worksop,,S81 0HT,Tel: 07825051637,No ratings yet Rate it yourself - /Services/careproviders/LeaveReview/DefaultView.aspx?id=1-8857074733,0,0,,
The Old Vicarage,1-966381891,SCL,Wellow Road,Old Ollerton,,Mansfield,Nottinghamshire,NG22 9AD,Tel: 01623824689,No ratings yet Rate it yourself - /Services/careproviders/LeaveReview/DefaultView.aspx?id=1-966381891,0,0,,
The Sycamores and The Poplars,1-18074215645,SCL,High Street,Warsop,,Mansfield,Nottinghamshire,NG20 0AA,Tel: 01623542860,No ratings yet Rate it yourself - /Services/careproviders/LeaveReview/DefaultView.aspx?id=1-18074215645,0,0,,
Helping Hands Team,1-2868661580,SCL,"Unit 3, Forest Court","Forest Road, New Ollerton",,Newark,,NG22 9PL,Tel: 01777573007,No ratings yet Rate it yourself - /Services/careproviders/LeaveReview/DefaultView.aspx?id=1-2868661580,0,0,,
Greenacres Grange,1-12962849335,SCL,Greenacres Park,Wingfield Avenue,,Worksop,,S81 0TA,Tel: 01909279045,No ratings yet Rate it yourself - /Services/careproviders/LeaveReview/DefaultView.aspx?id=1-12962849335,0,0,,
Ashley Care Centre,1-142839346,SCL,Sunnyside,,,Worksop,Nottinghamshire,S81 7LN,Tel: 01909500541,No ratings yet Rate it yourself - /Services/careproviders/LeaveReview/DefaultView.aspx?id=1-142839346,0,0,,
Pathfinders Neurological Care Centre,1-126973202,SCL,Darwin Drive,New Ollerton,,Newark,Nottinghamshire,NG22 9GW,Tel: 01623836639,No ratings yet Rate it yourself - /Services/careproviders/LeaveReview/DefaultView.aspx?id=1-126973202,0,0,,
Beech House Care Home,1-376418269,SCL,292-294 Carlton Road,,,Worksop,Nottinghamshire,S81 7LL,Tel: 01909472149,No ratings yet Rate it yourself - /Services/careproviders/LeaveReview/DefaultView.aspx?id=1-376418269,0,0,,
Start Service - Newark and Bassetlaw Locality,1-160392550,SCL,"Welbeck House, Darwin Drive","Sherwood Energy Village, New Ollerton",,Newark,Nottinghamshire,NG22 9FF,Tel: 01158042000,No ratings yet Rate it yourself - /Services/careproviders/LeaveReview/DefaultView.aspx?id=1-160392550,0,0,,
Bhandal Homecare,1-7745230105,SCL,1 Darwin Court,"Sherwood Energy Village, New Ollerton",,Newark,,NG22 9FE,Tel: 01636701117,No ratings yet Rate it yourself - /Services/careproviders/LeaveReview/DefaultView.aspx?id=1-7745230105,0,0,,
The Oaklands,1-159809183,SCL,Oakfield Lane,Warsop,,Mansfield,Nottinghamshire,NG20 0JE,Tel: 01623842080,No ratings yet Rate it yourself - /Services/careproviders/LeaveReview/DefaultView.aspx?id=1-159809183,0,0,,
Forest Hill,1-125855947,SCL,Forest Hill Park,,,Worksop,Nottinghamshire,S81 0NZ,Tel: 01909530531,No ratings yet Rate it yourself - /Services/careproviders/LeaveReview/DefaultView.aspx?id=1-125855947,0,0,,
Langwith Lodge Care Home,1-138315681,SCL,The Park,Nether Langwith,,Mansfield,Nottinghamshire,NG20 9ES,Tel: 01623742204,1 rating Rate it yourself - /Services/careproviders/LeaveReview/DefaultView.aspx?id=1-138315681,,,,
Broadleaves,1-13539559238,SCL,The Broadleaves,"Bishops Way, Boughton",,Newark,,NG22 9QD,Tel: 01623888340,No ratings yet Rate it yourself - /Services/careproviders/LeaveReview/DefaultView.aspx?id=1-13539559238,0,0,,
Jubilee Court Nursing Home,1-433918970,SCL,Gateford Road,,,Worksop,Nottinghamshire,S81 7BH,Tel: 01909530233,No ratings yet Rate it yourself - /Services/careproviders/LeaveReview/DefaultView.aspx?id=1-433918970,0,0,,
Boughton Manor Care Home,1-14326477770,SCL,Church Road,Boughton,,Newark,Nottinghamshire,NG22 9JX,Tel: 01623860436,No ratings yet Rate it yourself - /Services/careproviders/LeaveReview/DefaultView.aspx?id=1-14326477770,0,0,,
Real Social Care Solutions Ltd,1-10325206865,SCL,"Unit 25 The Tangent Business Hub, Weighbridge Road",Shirebrook,,Mansfield,,NG20 8XR,Tel: 01157830236,No ratings yet Rate it yourself - /Services/careproviders/LeaveReview/DefaultView.aspx?id=1-10325206865,0,0,,
Worksop,1-10495337322,SCL,29 Carrion View,Gateford,,Worksop,,S81 8UZ,Tel: 01909496553,No ratings yet Rate it yourself - /Services/careproviders/LeaveReview/DefaultView.aspx?id=1-10495337322,0,0,,
Whitwell Park,1-2049137324,SCL,130 Welbeck Street,Whitwell,,Worksop,Nottinghamshire,S80 4TP,Tel: 01909724800,No ratings yet Rate it yourself - /Services/careproviders/LeaveReview/DefaultView.aspx?id=1-2049137324,0,0,,
Oaklands Care Home,1-2896837062,SCL,238 North Street,Langwith,,Mansfield,Nottinghamshire,NG20 9BN,Tel: 01623744412,No ratings yet Rate it yourself - /Services/careproviders/LeaveReview/DefaultView.aspx?id=1-2896837062,0,0,,
Tigh Cranntail,1-3890735101,SCL,1 King Johns Court,"Main Road, Kings Clipstone",,Mansfield,Nottinghamshire,NG21 9BT,Tel: 01623820815,No ratings yet Rate it yourself - /Services/careproviders/LeaveReview/DefaultView.aspx?id=1-3890735101,0,0,,
The Poplars,1-116369333,SCL,1 The Poplars,,,Whitwell,Nottinghamshire,S80 4TD,Tel: 01909722244,No ratings yet Rate it yourself - /Services/careproviders/LeaveReview/DefaultView.aspx?id=1-116369333,0,0,,
Malborn Teroan House,1-9581533038,SCL,Main Road,Nether Langwith,,Mansfield,,NG20 9EN,Tel: 01623748392,No ratings yet Rate it yourself - /Services/careproviders/LeaveReview/DefaultView.aspx?id=1-9581533038,0,0,,
The Corner House,1-2049137374,SCL,65a Welbeck Street,Whitwell,,Worksop,Nottinghamshire,S80 4TW,Tel: 01909724800,No ratings yet Rate it yourself - /Services/careproviders/LeaveReview/DefaultView.aspx?id=1-2049137374,0,0,,
Gleamlite Services Limited,1-13632656056,SCL,"Suite 15, Enterprise House",Carlton Road,,Worksop,,S81 7QF,Tel: 01909281226,No ratings yet Rate it yourself - /Services/careproviders/LeaveReview/DefaultView.aspx?id=1-13632656056,0,0,,
Confident Home Care,1-14422652822,SCL,"Unit 16, Enterprise House",Carlton Road,,Worksop,,S81 7QF,,No ratings yet Rate it yourself - /Services/careproviders/LeaveReview/DefaultView.aspx?id=1-14422652822,0,0,,
Autism East Midlands Supported Living,1-3649073002,SCL,"Unit 31, Craggs Industrial Park","Morven Street, Creswell",,Worksop,Nottinghamshire,S80 4AJ,Tel: 01909506877,1 rating Rate it yourself - /Services/careproviders/LeaveReview/DefaultView.aspx?id=1-3649073002,,,,
The Woodlands Care Home,1-1887720344,SCL,Woodlands Way,"Spion Kop, Warsop",,Mansfield,Nottinghamshire,NG20 0FN,Tel: 01623845258,No ratings yet Rate it yourself - /Services/careproviders/LeaveReview/DefaultView.aspx?id=1-1887720344,0,0,,
SJW The Wright Care Ltd,1-284255660,SCL,The Turbine,Coach Close,,Worksop,Nottinghamshire,S81 8AP,Tel: 01909 512163,No ratings yet Rate it yourself - /Services/careproviders/LeaveReview/DefaultView.aspx?id=1-284255660,0,0,,
Hollybank Nursing Home,1-143068387,SCL,30-32 Skinner Street,Creswell,,Worksop,Nottinghamshire,S80 4JH,Tel: 01909721247,No ratings yet Rate it yourself - /Services/careproviders/LeaveReview/DefaultView.aspx?id=1-143068387,0,0,,
Personalised Support Team - North Nottinghamshire,1-2477671205,SCL,"Unit 3, The Point","Coach Road, Shireoaks",,Worksop,Nottinghamshire,S81 8BW,Tel: 01158443540,No ratings yet Rate it yourself - /Services/careproviders/LeaveReview/DefaultView.aspx?id=1-2477671205,0,0,,
Autumn Grange Nursing Home,1-131817829,SCL,Linden Road,Cresswell,,Worksop,Nottinghamshire,S80 4JT,Tel: 01909724098,No ratings yet Rate it yourself - /Services/careproviders/LeaveReview/DefaultView.aspx?id=1-131817829,0,0,,
Gateford Hill Care Home,1-15274728368,SCL,Gateford,,,Worksop,,S81 8AF,Tel: 01909475402,No ratings yet Rate it yourself - /Services/careproviders/LeaveReview/DefaultView.aspx?id=1-15274728368,0,0,,
Farthings Residential Care Home,1-8243233241,SCL,Old London Road,West Drayton,,Retford,,DN22 8ED,Tel: 01777838219,No ratings yet Rate it yourself - /Services/careproviders/LeaveReview/DefaultView.aspx?id=1-8243233241,0,0,,
Clipstone Hall & Lodge,1-8262841857,SCL,Mansfield Road,Clipstone Village,,Mansfield,Nottinghamshire,NG21 9FL,Tel: 01623636350,No ratings yet Rate it yourself - /Services/careproviders/LeaveReview/DefaultView.aspx?id=1-8262841857,0,0,,
AJS Community Support Care Services Ltd,1-18124176255,SCL,10 Limekiln Way,Shireoaks,,Worksop,,S81 8QS,Tel: 07555125879,No ratings yet Rate it yourself - /Services/careproviders/LeaveReview/DefaultView.aspx?id=1-18124176255,0,0,,
Clipstone House,1-8080882629,SCL,First Avenue,Clipstone Village,,Mansfield,,NG21 9DA,Tel: 01623 259590,No ratings yet Rate it yourself - /Services/careproviders/LeaveReview/DefaultView.aspx?id=1-8080882629,0,0,,
New Bassett House Care Home,1-121909793,SCL,Park Avenue,"New Bassett House, Shirebrook",,Mansfield,Nottinghamshire,NG20 8JW,Tel: 01629537117,1 rating Rate it yourself - /Services/careproviders/LeaveReview/DefaultView.aspx?id=1-121909793,,,,
Richmond Residential Care Home,1-2463336351,SCL,Recreation Road,Shirebrook,,Mansfield,Nottinghamshire,NG20 8QE,Tel: 01623748474,No ratings yet Rate it yourself - /Services/careproviders/LeaveReview/DefaultView.aspx?id=1-2463336351,0,0,,
Cherry Tree House,1-8617218215,SCL,201 Park Hall Road,Mansfield Woodhouse,,Mansfield,,NG19 8QX,Tel: 07825300368,No ratings yet Rate it yourself - /Services/careproviders/LeaveReview/DefaultView.aspx?id=1-8617218215,0,0,,
Pines,1-914040418,SCL,203 Park Hall Road,,,Mansfield Woodhouse,Nottinghamshire,NG19 8QX,Tel: 01623633152,No ratings yet Rate it yourself - /Services/careproviders/LeaveReview/DefaultView.aspx?id=1-914040418,0,0,,
The Grange Nursing and Residential Home,1-8687231175,SCL,Field Drive,Shirebrook,,Mansfield,Nottinghamshire,NG20 8BS,Tel: 01623747070,No ratings yet Rate it yourself - /Services/careproviders/LeaveReview/DefaultView.aspx?id=1-8687231175,0,0,,
Zarak and Company Limited,1-18822549926,SCL,32 Walnut Tree Crescent,Forest Town,,Mansfield,,NG19 0JB,,No ratings yet Rate it yourself - /Services/careproviders/LeaveReview/DefaultView.aspx?id=1-18822549926,0,0,,
TOTAL HEALTH CARE SOLUTIONS PVT LTD LIMITED,1-7419399814,SCL,Office F29,"Rossingtons Business Park, West Carr Road",,Retford,,DN22 7SW,Tel: 07378393555,1 rating Rate it yourself - /Services/careproviders/LeaveReview/DefaultView.aspx?id=1-7419399814,,,,
Glenesk Care Home,1-1635460086,SCL,"Glenesk, Queen Street",The Crescent,,Retford,Nottinghamshire,DN22 7BX,Tel: 01777702339,No ratings yet Rate it yourself - /Services/careproviders/LeaveReview/DefaultView.aspx?id=1-1635460086,0,0,,
Westvilla Nursing Home,1-112057321,SCL,Westfield Road,,,Retford,Nottinghamshire,DN22 7BT,Tel: 01777701636,No ratings yet Rate it yourself - /Services/careproviders/LeaveReview/DefaultView.aspx?id=1-112057321,0,0,,
Cherry Tree House,1-6980848635,SCL,96 Creswell Road,Clowne,,Chesterfield,,S43 4NA,Tel: 01246813258,1 rating Rate it yourself - /Services/careproviders/LeaveReview/DefaultView.aspx?id=1-6980848635,,,,
Esmer House,1-8061130748,SCL,22 Peafield Lane,Mansfield Woodhouse,,Mansfield,,NG19 9DT,Tel: 01623658784,No ratings yet Rate it yourself - /Services/careproviders/LeaveReview/DefaultView.aspx?id=1-8061130748,0,0,,
Iedale,1-8599586422,SCL,Iedale,London Road,,Retford,,DN22 7JG,Tel: 01909506678,No ratings yet Rate it yourself - /Services/careproviders/LeaveReview/DefaultView.aspx?id=1-8599586422,0,0,,
South Lodge,1-8599586305,SCL,South Lodge,London Road,,Retford,,DN22 7JJ,Tel: 01909506678,No ratings yet Rate it yourself - /Services/careproviders/LeaveReview/DefaultView.aspx?id=1-8599586305,0,0,,
Red Oaks Care Community,1-10198909495,SCL,116 Clipstone Road West,Forest Town,,Mansfield,Nottinghamshire,NG19 0HL,Tel: 01623644195,No ratings yet Rate it yourself - /Services/careproviders/LeaveReview/DefaultView.aspx?id=1-10198909495,0,0,,
Compassionate Care Team Ltd,1-2804697407,SCL,35 Bridgegate,,,Retford,Nottinghamshire,DN22 7UX,Tel: 01777711129,1 rating Rate it yourself - /Services/careproviders/LeaveReview/DefaultView.aspx?id=1-2804697407,,,,
The Hollies Residential Home,1-159789067,SCL,19-23 London Road,,,Retford,Nottinghamshire,DN22 6AT,Tel: 01777707750,No ratings yet Rate it yourself - /Services/careproviders/LeaveReview/DefaultView.aspx?id=1-159789067,0,0,,
Mason House,1-1634958882,SCL,6 Bracken Lane,Retford,,Nottingham,Nottinghamshire,DN22 7EU,Tel: 01777719720,No ratings yet Rate it yourself - /Services/careproviders/LeaveReview/DefaultView.aspx?id=1-1634958882,0,0,,
Total Healthcare Solutions PVT Ltd Limited,1-12242865885,SCL,"Office 18, Retford Enterprise Centre",Randall Way,,Retford,,DN22 7GR,,No ratings yet Rate it yourself - /Services/careproviders/LeaveReview/DefaultView.aspx?id=1-12242865885,0,0,,
Home Instead Senior Care Retford and Gainsborough,1-2131503050,SCL,Retford Enterprise Centre,Randall Way,,Retford,Nottinghamshire,DN22 7GR,Tel: 01777712629,No ratings yet Rate it yourself - /Services/careproviders/LeaveReview/DefaultView.aspx?id=1-2131503050,0,0,,
Barnby Court Care Home,1-14545259904,SCL,Barnby Moor,,,Retford,,DN22 8QS,Tel: 01777705902,No ratings yet Rate it yourself - /Services/careproviders/LeaveReview/DefaultView.aspx?id=1-14545259904,0,0,,
The Beeches,1-113728974,SCL,59 High Street,Mansfield Woodhouse,,Mansfield,Nottinghamshire,NG19 8BB,Tel: 01623421032,No ratings yet Rate it yourself - /Services/careproviders/LeaveReview/DefaultView.aspx?id=1-113728974,0,0,,
Mansfield Regional Office,1-2179725666,SCL,"First Floor, 1 Rose Lane",,,Mansfield Woodhouse,Nottinghamshire,NG19 8BA,Tel: 01623651987,No ratings yet Rate it yourself - /Services/careproviders/LeaveReview/DefaultView.aspx?id=1-2179725666,0,0,,
Mencap - Mansfield Domiciliary Care Agency,1-2503344256,SCL,"Agility House, High Street",Mansfield Woodhouse,,Mansfield,,NG19 8BA,Tel: 01623374380,No ratings yet Rate it yourself - /Services/careproviders/LeaveReview/DefaultView.aspx?id=1-2503344256,0,0,,
Kezi & Clay Healthcare,1-17413024504,SCL,"Suite 2b, Randall Business Centre",Randall Way,,Retford,,DN22 7WF,Tel: 07518807061,No ratings yet Rate it yourself - /Services/careproviders/LeaveReview/DefaultView.aspx?id=1-17413024504,0,0,,
The Right Home Care Team Chesterfield,1-12465565714,SCL,Clowne Business Centre,"Crown Street, Clowne",,Chesterfield,,S43 4DN,Tel: 01246956265,2 ratings Rate it yourself - /Services/careproviders/LeaveReview/DefaultView.aspx?id=1-12465565714,,,,
Respectful Care,1-990959904,SCL,"Office 10 , Park Road",Mansfield Woodhouse,,Mansfield,Nottinghamshire,NG19 8ER,Tel: 01623665011,No ratings yet Rate it yourself - /Services/careproviders/LeaveReview/DefaultView.aspx?id=1-990959904,0,0,,
Salisbury House,1-9704703055,SCL,York Street,East Markham,,Newark,,NG22 0QW,Tel: 01777871231,No ratings yet Rate it yourself - /Services/careproviders/LeaveReview/DefaultView.aspx?id=1-9704703055,0,0,,
Shauna HealthCare Services Solutions (Midlands),1-18802204475,SCL,93 Newlands Road,Forest Town,,Mansfield,,NG19 0HX,,No ratings yet Rate it yourself - /Services/careproviders/LeaveReview/DefaultView.aspx?id=1-18802204475,0,0,,
Haddon House Nursing Home,1-131817811,SCL,32-34 High Street,Clowne,,Chesterfield,Derbyshire,S43 4JU,Tel: 01246811106,No ratings yet Rate it yourself - /Services/careproviders/LeaveReview/DefaultView.aspx?id=1-131817811,0,0,,
DCC Bolsover Home Care,1-9752814550,SCL,The Arc,"High Street, Clowne",,Chesterfield,Derbyshire,S43 4JY,Tel: 01629537040,No ratings yet Rate it yourself - /Services/careproviders/LeaveReview/DefaultView.aspx?id=1-9752814550,0,0,,
Mansfield Supported living,1-13781426154,SCL,32 Station Street,Mansfield Woodhouse,,Mansfield,,NG19 8AB,,No ratings yet Rate it yourself - /Services/careproviders/LeaveReview/DefaultView.aspx?id=1-13781426154,0,0,,
Free Spirit Support Service,1-17035566575,SCL,133 Moorgate,,,Retford,,DN22 6RS,,No ratings yet Rate it yourself - /Services/careproviders/LeaveReview/DefaultView.aspx?id=1-17035566575,0,0,,
Cliff House Care Home,1-4205591134,SCL,Cliff Hill,Clowne,,Chesterfield,Derbyshire,S43 4LE,Tel: 01246810246,No ratings yet Rate it yourself - /Services/careproviders/LeaveReview/DefaultView.aspx?id=1-4205591134,0,0,,
Parkside Nursing Home,1-131817844,SCL,Olive Grove,Forest Town,,Mansfield,Nottinghamshire,NG19 0AR,Tel: 01623655341,No ratings yet Rate it yourself - /Services/careproviders/LeaveReview/DefaultView.aspx?id=1-131817844,0,0,,
St Saviours Care Home,1-125549970,SCL,5 Lidget Lane,,,Retford,Nottinghamshire,DN22 6QW,Tel: 01777703040,1 rating Rate it yourself - /Services/careproviders/LeaveReview/DefaultView.aspx?id=1-125549970,,,,
Manswick Care Home,1-8025109084,SCL,2 Oakland Road,Forest Town,,Mansfield,,NG19 0EJ,Tel: 01623422405,1 rating Rate it yourself - /Services/careproviders/LeaveReview/DefaultView.aspx?id=1-8025109084,,,,
Charnwood House,1-13903807320,SCL,Charnwood,"Back Lane, Eakring",,Newark,,NG22 0DJ,Tel: 01623392127,No ratings yet Rate it yourself - /Services/careproviders/LeaveReview/DefaultView.aspx?id=1-13903807320,0,0,,
Sternhill Paddock,1-2822704974,SCL,"Back Lane, Eakring",,,Newark,Nottinghamshire,NG22 0DJ,Tel: 01623411410,No ratings yet Rate it yourself - /Services/careproviders/LeaveReview/DefaultView.aspx?id=1-2822704974,0,0,,
Truly Care Services,1-12002179829,SCL,"Office 1, Olive House",Blake Street,,Mansfield,,NG19 9NT,Tel: 07411209316,1 rating Rate it yourself - /Services/careproviders/LeaveReview/DefaultView.aspx?id=1-12002179829,,,,
Your Home Care,1-9580502733,SCL,The Sidings,Mansfield Woodhouse,,Mansfield,,NG19 7FE,Tel: 01623375275,No ratings yet Rate it yourself - /Services/careproviders/LeaveReview/DefaultView.aspx?id=1-9580502733,0,0,,
Dannsa House,1-6437025383,SCL,Lincoln Road,East Markham,,Newark,,NG22 0SS,Tel: 01777870656,No ratings yet Rate it yourself - /Services/careproviders/LeaveReview/DefaultView.aspx?id=1-6437025383,0,0,,
Blyth Country House Care Home,1-112143071,SCL,Spital House,"Spital Road, Blyth",,Worksop,Nottinghamshire,S81 8DU,Tel: 01909212137,1 rating Rate it yourself - /Services/careproviders/LeaveReview/DefaultView.aspx?id=1-112143071,,,,
Cherry Holt Care Home,1-233905581,SCL,28 Welham Road,,,Retford,Nottinghamshire,DN22 6TN,Tel: 01777710347,1 rating Rate it yourself - /Services/careproviders/LeaveReview/DefaultView.aspx?id=1-233905581,,,,
Branthwaite Care Home,1-140342750,SCL,34 Welham Road,,,Retford,Nottinghamshire,DN22 6TN,Tel: 01777706720,No ratings yet Rate it yourself - /Services/careproviders/LeaveReview/DefaultView.aspx?id=1-140342750,0,0,,
Stamford Healthcare Limited,1-15119165080,SCL,19 Faraday Avenue,Tuxford,,Newark,,NG22 0HT,,No ratings yet Rate it yourself - /Services/careproviders/LeaveReview/DefaultView.aspx?id=1-15119165080,0,0,,
TTT Testimonies Ltd,1-17766334073,SCL,18 Francis Way,,,Retford,,DN22 6TQ,,No ratings yet Rate it yourself - /Services/careproviders/LeaveReview/DefaultView.aspx?id=1-17766334073,0,0,,
Fosse Healthcare - Armstrong Gardens,1-11213033340,SCL,Burton Court Community Centre,"Scarborough Road, Bilsthorpe",,Newark,,NG22 8QP,Tel: 01623871113,No ratings yet Rate it yourself - /Services/careproviders/LeaveReview/DefaultView.aspx?id=1-11213033340,0,0,,
Orchard End,1-3068813205,SCL,88 Welham Road,,,Retford,Nottinghamshire,DN22 6UG,Tel: 01777701102,No ratings yet Rate it yourself - /Services/careproviders/LeaveReview/DefaultView.aspx?id=1-3068813205,0,0,,