Organisation Name,NACS Code,Organisation Type,Address1,Address2,Address3,Address4,Address5,PostCode,Telephone Number,NHS.UK users rating,Value  (NHS.UK users rating),Banding Classification  (NHS.UK users rating),Car parking (Is there car parking at this organisation?),Disabled access (Disabled access)
Parklands,1-2029305060,SCL,Callow Hill Lane,Callow Hill,,Redditch,Worcestershire,B97 5PU,Tel: 01527 544581,No ratings yet Rate it yourself - /Services/careproviders/LeaveReview/DefaultView.aspx?id=1-2029305060,0,0,,
V.I.P Support,1-9187148052,SCL,47 Heathfield Road,,,Redditch,,B97 5RB,Tel: 07580140007,No ratings yet Rate it yourself - /Services/careproviders/LeaveReview/DefaultView.aspx?id=1-9187148052,0,0,,
St Martins Care Home Ltd,1-3678776649,SCL,22 Feckenham Road,Headless Cross,,Redditch,Worcestershire,B97 5AR,Tel: 01527544592,No ratings yet Rate it yourself - /Services/careproviders/LeaveReview/DefaultView.aspx?id=1-3678776649,0,0,,
Brambles Residential Care Home,1-124396095,SCL,Birchfield Road,,,Redditch,Worcestershire,B97 4LX,Tel: 01527555800,No ratings yet Rate it yourself - /Services/careproviders/LeaveReview/DefaultView.aspx?id=1-124396095,0,0,,
Stonebridge Nursing Home,1-110543345,SCL,178-180 Birchfield Road,Headless Cross,,Redditch,Worcestershire,B97 4NA,,No ratings yet Rate it yourself - /Services/careproviders/LeaveReview/DefaultView.aspx?id=1-110543345,0,0,,
Haversham House,1-9882731336,SCL,327 Bromsgrove Road,,,Redditch,Worcestershire,B97 4NH,Tel: 01217206999,No ratings yet Rate it yourself - /Services/careproviders/LeaveReview/DefaultView.aspx?id=1-9882731336,0,0,,
Abbeycroft,1-113524636,SCL,16 Crabbs Cross Lane,Crabbs Cross,,Redditch,Worcestershire,B97 5LD,Tel: 01527540403,No ratings yet Rate it yourself - /Services/careproviders/LeaveReview/DefaultView.aspx?id=1-113524636,0,0,,
Plymouth Court Limited,1-128275551,SCL,Plymouth Close,Headless Cross,,Redditch,Worcestershire,B97 4NR,Tel: 01527404446,No ratings yet Rate it yourself - /Services/careproviders/LeaveReview/DefaultView.aspx?id=1-128275551,0,0,,
Radis Community Care (Dorothy Terry House),1-8161752801,SCL,203 Evesham Road,,,Redditch,,B97 5EN,Tel: 01527540325,No ratings yet Rate it yourself - /Services/careproviders/LeaveReview/DefaultView.aspx?id=1-8161752801,0,0,,
HF Trust - 1 Foxlydiate Mews,1-120702037,SCL,1 Foxlydiate Mews,Lock Close,,Redditch,Worcestershire,B97 6LQ,Tel: 0152760482,1 rating Rate it yourself - /Services/careproviders/LeaveReview/DefaultView.aspx?id=1-120702037,,,,
Southcrest Nursing Home,1-155491854,SCL,215 Mount Pleasant,Southcrest,,Redditch,Worcestershire,B97 4JG,Tel: 01527550720,No ratings yet Rate it yourself - /Services/careproviders/LeaveReview/DefaultView.aspx?id=1-155491854,0,0,,
Caremark (Redditch and Bromsgrove),1-7149523098,SCL,5 Clews Road,,,Redditch,Worcestershire,B98 7ST,Tel: 01527521777,1 rating Rate it yourself - /Services/careproviders/LeaveReview/DefaultView.aspx?id=1-7149523098,,,,
St David's House,1-140628598,SCL,Willow Way,Batchley,,Redditch,Worcestershire,B97 6PG,Tel: 01527584769,No ratings yet Rate it yourself - /Services/careproviders/LeaveReview/DefaultView.aspx?id=1-140628598,0,0,,
The Field View Residential Home,1-3988196832,SCL,The Slough,Crabbs Cross,,Redditch,Worcestershire,B97 5JT,Tel: 01527550248,No ratings yet Rate it yourself - /Services/careproviders/LeaveReview/DefaultView.aspx?id=1-3988196832,0,0,,
All For You Home Care Limited,1-5140171860,SCL,Bridge House,22 Bromsgrove Road,,Redditch,,B97 4QY,Tel: 01527758448,1 rating Rate it yourself - /Services/careproviders/LeaveReview/DefaultView.aspx?id=1-5140171860,,,,
Eclipse HomeCare (Terryspring Court),1-6400897432,SCL,"Terryspring Court, West Avenue",Smallwood,,Redditch,,B98 7DJ,Tel: 0152766565,No ratings yet Rate it yourself - /Services/careproviders/LeaveReview/DefaultView.aspx?id=1-6400897432,0,0,,
HAB Support Ltd,1-15266376085,SCL,"Suite 3, The Business Centre",Edward Street,,Redditch,,B97 6HA,Tel: 01527222080,No ratings yet Rate it yourself - /Services/careproviders/LeaveReview/DefaultView.aspx?id=1-15266376085,0,0,,
The Business Centre,1-3514444051,SCL,"Unit 45, The Business Centre",Edward Street,,Redditch,,B97 6HA,Tel: 07484915361,No ratings yet Rate it yourself - /Services/careproviders/LeaveReview/DefaultView.aspx?id=1-3514444051,0,0,,
Step Up Training and Care Ltd,1-14955210869,SCL,"The Business Centre,",Edward Street,,Redditch,,B97 6HA,,No ratings yet Rate it yourself - /Services/careproviders/LeaveReview/DefaultView.aspx?id=1-14955210869,0,0,,
Stoke Heath Homecare Ltd,1-2937430014,SCL,The Business Centre,Edward Street,,Redditch,Worcestershire,B97 6HA,Tel: 0247044495,No ratings yet Rate it yourself - /Services/careproviders/LeaveReview/DefaultView.aspx?id=1-2937430014,0,0,,
Bowood Court & Mews,1-2267662781,SCL,Hewell Road,,,Redditch,Worcestershire,B97 6AT,Tel: 0152765115,1 rating Rate it yourself - /Services/careproviders/LeaveReview/DefaultView.aspx?id=1-2267662781,,,,
Supreme Home Care Redditch and Bromsgrove,1-311358268,SCL,Marlborough House,37 Prospect Hill,,Redditch,Worcestershire,B97 4BS,Tel: 01527844444,No ratings yet Rate it yourself - /Services/careproviders/LeaveReview/DefaultView.aspx?id=1-311358268,0,0,,
Excalibur Serviced Offices,1-3130837660,SCL,Securehold Business Centre,Studley Road,,Redditch,Worcestershire,B98 7LG,Tel: 01527909435,3 ratings Rate it yourself - /Services/careproviders/LeaveReview/DefaultView.aspx?id=1-3130837660,,,,
Millcroft,1-14377335185,SCL,Alfrick Close,,,Redditch,,B97 6RU,,No ratings yet Rate it yourself - /Services/careproviders/LeaveReview/DefaultView.aspx?id=1-14377335185,0,0,,
Kingfisher Care Services,1-5774921848,SCL,"Unit 3a, Hepworth Park",Brook Street,,Redditch,,B98 8NZ,Tel: 07714469494,No ratings yet Rate it yourself - /Services/careproviders/LeaveReview/DefaultView.aspx?id=1-5774921848,0,0,,
Four Acres,1-508679999,SCL,Archer Close,,,Studley,Warwickshire,B80 7HX,Tel: 01527850549,No ratings yet Rate it yourself - /Services/careproviders/LeaveReview/DefaultView.aspx?id=1-508679999,0,0,,
Studley Rose Care Home,1-10883098030,SCL,Pool Road,,,Studley,,B80 7QU,Tel: 07483046156,No ratings yet Rate it yourself - /Services/careproviders/LeaveReview/DefaultView.aspx?id=1-10883098030,0,0,,
Quality Assured Care Services Ltd,1-4381425190,SCL,"Haydon House, 5 Alcester Road",,,Studley,Warwickshire,B80 7AN,Tel: 07577616164,1 rating Rate it yourself - /Services/careproviders/LeaveReview/DefaultView.aspx?id=1-4381425190,,,,
Individual Care Services,1-1643939071,SCL,25 Alcester Road,,,Studley,Warwickshire,B80 7LL,Tel: 01527857280,No ratings yet Rate it yourself - /Services/careproviders/LeaveReview/DefaultView.aspx?id=1-1643939071,0,0,,
Rainbow Care Solutions (Redditch),1-3029438512,SCL,2 Oak Tree Park,Burnt Meadow Road,,Redditch,Worcestershire,B98 9NN,Tel: 01527585700,No ratings yet Rate it yourself - /Services/careproviders/LeaveReview/DefaultView.aspx?id=1-3029438512,0,0,,
Miles House - 4 Hentland Close,1-310928802,SCL,Winyates West,,,Redditch,Worcestershire,B98 0LP,Tel: 01527455705,No ratings yet Rate it yourself - /Services/careproviders/LeaveReview/DefaultView.aspx?id=1-310928802,0,0,,
Tutnall Hall Nursing Home,1-805758970,SCL,Tutnall Lane,Tutnall,,Bromsgrove,Worcestershire,B60 1NA,Tel: 01527 875854,No ratings yet Rate it yourself - /Services/careproviders/LeaveReview/DefaultView.aspx?id=1-805758970,0,0,,
Lifeways Community Care (Worcester),1-13905386707,SCL,Base Point Bromsgrove Enterprise Park,Isidore Rd,,Bromsgrove,,B60 3ET,Tel: 01527913450,No ratings yet Rate it yourself - /Services/careproviders/LeaveReview/DefaultView.aspx?id=1-13905386707,0,0,,
Divine Health Services Limited,1-2857863813,SCL,Unit 59,"Basepoint Business Centre, Isidore Road",,Bromsgrove,,B60 3ET,Tel: 03309950101,No ratings yet Rate it yourself - /Services/careproviders/LeaveReview/DefaultView.aspx?id=1-2857863813,0,0,,
Alina Homecare Bromsgrove,1-130488908,SCL,Harris Business Park,Hanbury Road,,Bromsgrove,Worcestershire,B60 4FG,Tel: 01527 914093,No ratings yet Rate it yourself - /Services/careproviders/LeaveReview/DefaultView.aspx?id=1-130488908,0,0,,
Right at Home Bromsgrove,1-15645160278,SCL,4 West Court,"Saxon Business Park, Hanbury Road, Stoke Prior",,Bromsgrove,,B60 4AD,Tel: 015279216070,No ratings yet Rate it yourself - /Services/careproviders/LeaveReview/DefaultView.aspx?id=1-15645160278,0,0,,
Blue Recruit LTD,1-13175404811,SCL,"Suite 2, Banham House",Stoke Prior,,Bromsgrove,,B60 4JZ,Tel: 01216636305,No ratings yet Rate it yourself - /Services/careproviders/LeaveReview/DefaultView.aspx?id=1-13175404811,0,0,,
Haywood Lodge,1-13065126349,SCL,Warwick Highway,Mappleborough Green,,Studley,,B80 7DG,,No ratings yet Rate it yourself - /Services/careproviders/LeaveReview/DefaultView.aspx?id=1-13065126349,0,0,,
Bluebird Care (Bromsgrove & Redditch),1-965462877,SCL,3 Millennium Court,Buntsford Park Road,,Bromsgrove,Worcestershire,B60 3DX,Tel: 01527916442,No ratings yet Rate it yourself - /Services/careproviders/LeaveReview/DefaultView.aspx?id=1-965462877,0,0,,
House of Care Services Ltd,1-507870114,SCL,8 The Courtyard,Buntsford Drive,,Bromsgrove,Worcestershire,B60 3DJ,Tel: 02476637969,No ratings yet Rate it yourself - /Services/careproviders/LeaveReview/DefaultView.aspx?id=1-507870114,0,0,,
Old Friends Care Limited,1-8572398691,SCL,5 Regents Court,Farmoor Lane,,Redditch,,B98 0SD,Tel: 01527525583,No ratings yet Rate it yourself - /Services/careproviders/LeaveReview/DefaultView.aspx?id=1-8572398691,0,0,,
Eclipse Homecare (Bromsgrove & Kidderminster),1-2840045800,SCL,37 Gilbert Road,Gilbert Court,,Bromsgrove,Worcestershire,B60 3JZ,Tel: 01527573939,No ratings yet Rate it yourself - /Services/careproviders/LeaveReview/DefaultView.aspx?id=1-2840045800,0,0,,
Burcot Grange,1-14039434478,SCL,23 Greenhill,Burcot,,Bromsgrove,Worcestershire,B60 1BJ,Tel: 01162674835,No ratings yet Rate it yourself - /Services/careproviders/LeaveReview/DefaultView.aspx?id=1-14039434478,0,0,,
The Lodge at Burcot Grange,1-4511191528,SCL,23 Greenhill,Burcot,,Bromsgrove,Worcestershire,B60 1BJ,Tel: 01214455552,No ratings yet Rate it yourself - /Services/careproviders/LeaveReview/DefaultView.aspx?id=1-4511191528,0,0,,
The Lawns Residential Care,1-445915633,SCL,School Lane,Alvechurch,,Birmingham,West Midlands,B48 7SB,Tel: 01214454098,No ratings yet Rate it yourself - /Services/careproviders/LeaveReview/DefaultView.aspx?id=1-445915633,0,0,,
Heathbrook House Care Home,1-130112995,SCL,223-229 Worcester Road,Stoke Heath,,Bromsgrove,Worcestershire,B61 7JA,Tel: 01527882146,No ratings yet Rate it yourself - /Services/careproviders/LeaveReview/DefaultView.aspx?id=1-130112995,0,0,,
Wayside Care Home,1-650533794,SCL,25 New Road,,,Bromsgrove,Worcestershire,B60 2JQ,Tel: 01527837774,No ratings yet Rate it yourself - /Services/careproviders/LeaveReview/DefaultView.aspx?id=1-650533794,0,0,,
Dimensions 7 School Drive,1-352580036,SCL,Spadesbrook House,7 School Drive,,Bromsgrove,Worcestershire,B60 1AX,Tel: 01527874827,No ratings yet Rate it yourself - /Services/careproviders/LeaveReview/DefaultView.aspx?id=1-352580036,0,0,,
Care Force Limited,1-312765144,SCL,Holland House,12A High Street,,Bromsgrove,Worcestershire,B61 8HQ,Tel: 01527577247,No ratings yet Rate it yourself - /Services/careproviders/LeaveReview/DefaultView.aspx?id=1-312765144,0,0,,
Housman Care Ltd,1-12162762955,SCL,Housman Court,School Drive,,Bromsgrove,Worcestershire,B60 1AZ,Tel: 01527575440,No ratings yet Rate it yourself - /Services/careproviders/LeaveReview/DefaultView.aspx?id=1-12162762955,0,0,,
Helping Hands Redditch & Bromsgrove,1-4652126081,SCL,Ground Floor,21 The Strand,,Bromsgrove,,B61 8AB,Tel: 01527910483,No ratings yet Rate it yourself - /Services/careproviders/LeaveReview/DefaultView.aspx?id=1-4652126081,0,0,,
M N Pulse Solutions,1-10161000025,SCL,Unit 8,"The Strand, Strand Centre 2-4",,Bromsgrove,,B61 8AB,Tel: 07878863114,No ratings yet Rate it yourself - /Services/careproviders/LeaveReview/DefaultView.aspx?id=1-10161000025,0,0,,
Pulse8+ Ltd,1-2106498773,SCL,20 St. John Street,,,Bromsgrove,,B61 8QY,Tel: 01527870879,No ratings yet Rate it yourself - /Services/careproviders/LeaveReview/DefaultView.aspx?id=1-2106498773,0,0,,
St John's Court,1-144158060,SCL,St Johns Street,,,Bromsgrove,Worcestershire,B61 8QT,Tel: 01527575070,No ratings yet Rate it yourself - /Services/careproviders/LeaveReview/DefaultView.aspx?id=1-144158060,0,0,,
Yourlife (Bromsgrove),1-4780659566,SCL,Bilberry Place,Recreation Road,,Bromsgrove,,B61 8DT,Tel: 01527872749,No ratings yet Rate it yourself - /Services/careproviders/LeaveReview/DefaultView.aspx?id=1-4780659566,0,0,,
Chandler Court,1-4767351188,SCL,Recreation Road,,,Bromsgrove,Worcestershire,B61 8DT,Tel: 03334552317,No ratings yet Rate it yourself - /Services/careproviders/LeaveReview/DefaultView.aspx?id=1-4767351188,0,0,,
Grosvenor House,1-805715086,SCL,Aqueduct Lane,Coopers Hill,,Birmingham,Worcestershire,B48 7BS,Tel: 0121 447 7878,No ratings yet Rate it yourself - /Services/careproviders/LeaveReview/DefaultView.aspx?id=1-805715086,0,0,,
Seco Support (Birmingham),1-15928186846,SCL,Walnut Tree House,"Astwood Lane, Wychbold",,Droitwich,,WR9 0BU,Tel: 07760676109,No ratings yet Rate it yourself - /Services/careproviders/LeaveReview/DefaultView.aspx?id=1-15928186846,0,0,,
1 Windmilll Barns,1-18175710344,SCL,1 Windmill Barns,"New End Farm Road, Coughton",,Alcester,,B49 6GE,Tel: 07739849045,No ratings yet Rate it yourself - /Services/careproviders/LeaveReview/DefaultView.aspx?id=1-18175710344,0,0,,
Breme Residential Care Home,1-124396114,SCL,Breme,46 Providence Road,,Bromsgrove,Worcestershire,B61 8EF,Tel: 01527813690,1 rating Rate it yourself - /Services/careproviders/LeaveReview/DefaultView.aspx?id=1-124396114,,,,
JLKare and Support Limited,1-2828591836,SCL,168c,Birmingham Road,,Bromsgrove,,B61 0HB,Tel: 07803547117,No ratings yet Rate it yourself - /Services/careproviders/LeaveReview/DefaultView.aspx?id=1-2828591836,0,0,,
Regents Court Care Home,1-6671160716,SCL,128 Stourbridge Road,,,Bromsgrove,Worcestershire,B61 0AN,Tel: 01527879119,No ratings yet Rate it yourself - /Services/careproviders/LeaveReview/DefaultView.aspx?id=1-6671160716,0,0,,
Exmoor Drive,1-147763145,SCL,1-7 Exmoor Drive,,,Bromsgrove,Worcestershire,B61 0TW,Tel: 01527576591,No ratings yet Rate it yourself - /Services/careproviders/LeaveReview/DefaultView.aspx?id=1-147763145,0,0,,
Redwood House Residential Home,1-152749539,SCL,Cherry Hill Road,Barnt Green,,Birmingham,West Midlands,B45 8LL,Tel: 01214477447,No ratings yet Rate it yourself - /Services/careproviders/LeaveReview/DefaultView.aspx?id=1-152749539,0,0,,
The Leys Residential Home,1-15525650331,SCL,Old Birmingham Road,Alvechurch,,Birmingham,West Midlands,B48 7TQ,Tel: 01214455587,No ratings yet Rate it yourself - /Services/careproviders/LeaveReview/DefaultView.aspx?id=1-15525650331,0,0,,
The Mill House Care Home,1-140361465,SCL,Kington,Flyford Flavell,,Worcester,Worcestershire,WR7 4DG,Tel: 01386793110,2 ratings Rate it yourself - /Services/careproviders/LeaveReview/DefaultView.aspx?id=1-140361465,,,,
Home Instead (Redditch and Bromsgrove),1-763924758,SCL,The Coach House,Oldberrow Manor,,Redditch,Worcestershire,B95 5PF,Tel: 01564 741620,1 rating Rate it yourself - /Services/careproviders/LeaveReview/DefaultView.aspx?id=1-763924758,,,,
Merecroft,1-1483438374,SCL,Seafield Lane,Alvechurch,,Birmingham,West Midlands,B48 7HN,Tel: 01564829963,No ratings yet Rate it yourself - /Services/careproviders/LeaveReview/DefaultView.aspx?id=1-1483438374,0,0,,
Windmill Hill Consultants Limited,1-2482369933,SCL,19b Twatling Road,Barnt Green,,Birmingham,West Midlands,B45 8HX,Tel: 01214483348,No ratings yet Rate it yourself - /Services/careproviders/LeaveReview/DefaultView.aspx?id=1-2482369933,0,0,,
Rashwood,1-119255502,SCL,Wychbold,,,Droitwich,Worcestershire,WR9 0BP,Tel: 01527861258,No ratings yet Rate it yourself - /Services/careproviders/LeaveReview/DefaultView.aspx?id=1-119255502,0,0,,
Helping Hands Warwickshire,1-121872528,SCL,Arden Quarter,Alcester Road,,Stratford-upon-avon,,CV37 6PP,Tel: 01789762212,84 ratings Rate it yourself - /Services/careproviders/LeaveReview/DefaultView.aspx?id=1-121872528,,,,
Esteemed Life Warwickshire,1-7018055287,SCL,Minerva Mill Innovation Centre,Station Road,,Alcester,Warwickshire,B49 5ET,Tel: 01789336001,No ratings yet Rate it yourself - /Services/careproviders/LeaveReview/DefaultView.aspx?id=1-7018055287,0,0,,
In Safe Hands Community Care Services,1-1453197965,SCL,Alcester Business Centre,4 Kinwarton Farm Road,,Alcester,Warwickshire,B49 6EL,Tel: 01789777519,No ratings yet Rate it yourself - /Services/careproviders/LeaveReview/DefaultView.aspx?id=1-1453197965,0,0,,
Caring People,1-2041672719,SCL,485 Birmingham Road,,,Bromsgrove,,B61 0HZ,Tel: 0152768680,No ratings yet Rate it yourself - /Services/careproviders/LeaveReview/DefaultView.aspx?id=1-2041672719,0,0,,
Meadow View,1-131820329,SCL,Meadow View Close,Off Wharrage Road,,Alcester,Warwickshire,B49 6PR,Tel: 01789766739,1 rating Rate it yourself - /Services/careproviders/LeaveReview/DefaultView.aspx?id=1-131820329,,,,
Appletrees Care Home,1-11547688402,SCL,242 Stourbridge Road,Catshill,,Bromsgrove,Worcestershire,B61 9LE,Tel: 01527877152,No ratings yet Rate it yourself - /Services/careproviders/LeaveReview/DefaultView.aspx?id=1-11547688402,0,0,,
Hopwood Court,1-116519735,SCL,Birmingham Road,"Hopwood, Alvechurch",,Birmingham,West Midlands,B48 7AQ,Tel: 01214454743,No ratings yet Rate it yourself - /Services/careproviders/LeaveReview/DefaultView.aspx?id=1-116519735,0,0,,
Mockley Manor Care Home,1-479283155,SCL,Forde Hall Lane,Ullenhall,,Henley In Arden,Warwickshire,B95 5PS,Tel: 01564742325,2 ratings Rate it yourself - /Services/careproviders/LeaveReview/DefaultView.aspx?id=1-479283155,,,,
Upper Ford Lodge,1-129855529,SCL,Ford Lane,,,Droitwich,Worcestershire,WR9 0BQ,Tel: 01905779949,No ratings yet Rate it yourself - /Services/careproviders/LeaveReview/DefaultView.aspx?id=1-129855529,0,0,,
Havencroft Nursing Home,1-144191748,SCL,Lea End Lane,Hopwood,,Birmingham,West Midlands,B48 7AS,Tel: 01214452154,No ratings yet Rate it yourself - /Services/careproviders/LeaveReview/DefaultView.aspx?id=1-144191748,0,0,,
YourLife (Droitwich),1-2213119679,SCL,Horton Mill Court,Hanbury Road,,Droitwich,Worcestershire,WR9 8GD,Tel: 01905770288,No ratings yet Rate it yourself - /Services/careproviders/LeaveReview/DefaultView.aspx?id=1-2213119679,0,0,,
Cherry Trees,1-125862531,SCL,Stratford Road,Oversley Green,,Alcester,Warwickshire,B49 6LN,Tel: 01789764022,1 rating Rate it yourself - /Services/careproviders/LeaveReview/DefaultView.aspx?id=1-125862531,,,,
Brindley Manor Nursing Home,1-9983923716,SCL,St. Peters Walk,,,Droitwich,,WR9 8EX,Tel: 01905794506,No ratings yet Rate it yourself - /Services/careproviders/LeaveReview/DefaultView.aspx?id=1-9983923716,0,0,,
Malvern View,1-116046397,SCL,573 Birmingham Road,Lydiate Ash,,Bromsgrove,Worcestershire,B61 0HX,Tel: 01214537727,No ratings yet Rate it yourself - /Services/careproviders/LeaveReview/DefaultView.aspx?id=1-116046397,0,0,,
The Priory Care Home,1-121484291,SCL,Crutch Lane,Dodderhill,,Droitwich,Worcestershire,WR9 0BE,Tel: 01905771595,No ratings yet Rate it yourself - /Services/careproviders/LeaveReview/DefaultView.aspx?id=1-121484291,0,0,,
Alcester Home Care Agency Ltd,1-3839757749,SCL,Great Alne Park,Park Lane,,Alcester,Warwickshire,B49 6HS,Tel: 01789765468,No ratings yet Rate it yourself - /Services/careproviders/LeaveReview/DefaultView.aspx?id=1-3839757749,0,0,,
Droitwich Mews Care Home,1-9706807476,SCL,Mulberry Tree Hill,,,Droitwich,,WR9 7SS,Tel: 01604675566,No ratings yet Rate it yourself - /Services/careproviders/LeaveReview/DefaultView.aspx?id=1-9706807476,0,0,,
Advance Warwickshire and Worcestershire,1-15112584637,SCL,Kings Court,Worcester Road,,Droitwich,,WR9 8AG,Tel: 01905795899,No ratings yet Rate it yourself - /Services/careproviders/LeaveReview/DefaultView.aspx?id=1-15112584637,0,0,,
Cofton Park Manor Care Home,1-14165733927,SCL,466 Lickey Road,Cofton Hackett,,Birmingham,,B45 8UU,Tel: 01213872722,1 rating Rate it yourself - /Services/careproviders/LeaveReview/DefaultView.aspx?id=1-14165733927,,,,
Uplifting Lives Services Ltd,1-5600612940,SCL,1a Nellies Yard,High Street,,Droitwich,,WR9 8ES,Tel: 01905954424,No ratings yet Rate it yourself - /Services/careproviders/LeaveReview/DefaultView.aspx?id=1-5600612940,0,0,,
North Star Foundation,1-201080733,SCL,8 Old Market Court,High Street,,Droitwich,Worcestershire,WR9 8ES,Tel: 01905772233,No ratings yet Rate it yourself - /Services/careproviders/LeaveReview/DefaultView.aspx?id=1-201080733,0,0,,
Newland Hurst,1-115610691,SCL,Newland Lane,"Newland, Droitwich Spa",,Droitwich,Worcestershire,WR9 7JH,Tel: 01905 773156,No ratings yet Rate it yourself - /Services/careproviders/LeaveReview/DefaultView.aspx?id=1-115610691,0,0,,
Woodland View Care Home,1-14186664916,SCL,Woodland Way,,,Droitwich,,WR9 7GP,Tel: 01905917358,No ratings yet Rate it yourself - /Services/careproviders/LeaveReview/DefaultView.aspx?id=1-14186664916,0,0,,
Corbett House Nursing Home,1-629935882,SCL,40-42 Corbett Avenue,,,Droitwich,Worcestershire,WR9 7BE,Tel: 01905770572,2 ratings Rate it yourself - /Services/careproviders/LeaveReview/DefaultView.aspx?id=1-629935882,,,,
Civicare (Central) Ltd,1-2344181179,SCL,Unit 4A,40 St Andrews House,,Droitwich,Worcestershire,WR9 8HE,Tel: 01905 770110,No ratings yet Rate it yourself - /Services/careproviders/LeaveReview/DefaultView.aspx?id=1-2344181179,0,0,,
Maple Leaf Lodge,1-116046416,SCL,Icknield Street,Forhill,,Birmingham,West Midlands,B38 9EG,Tel: 01564824594,No ratings yet Rate it yourself - /Services/careproviders/LeaveReview/DefaultView.aspx?id=1-116046416,0,0,,
Virtuous Business Solutions Limited,1-10587106120,SCL,65 Ombersley Street East,,,Droitwich,,WR9 8QS,Tel: 07960102647,No ratings yet Rate it yourself - /Services/careproviders/LeaveReview/DefaultView.aspx?id=1-10587106120,0,0,,
The Meadows Nursing Home,1-135582992,SCL,656 Birmingham Road,Spring Pools,,Bromsgrove,Worcestershire,B61 0QD,Tel: 01214535044,No ratings yet Rate it yourself - /Services/careproviders/LeaveReview/DefaultView.aspx?id=1-135582992,0,0,,
Safeharbour (Droitwich),1-118314634,SCL,52 Corbett Avenue,,,Droitwich,Worcestershire,WR9 7BH,Tel: 01905796214,No ratings yet Rate it yourself - /Services/careproviders/LeaveReview/DefaultView.aspx?id=1-118314634,0,0,,
Dorset House Nursing Home,1-2188142731,SCL,Blackfriars Avenue,,,Droitwich,Worcestershire,WR9 8DR,Tel: 01905 772710,No ratings yet Rate it yourself - /Services/careproviders/LeaveReview/DefaultView.aspx?id=1-2188142731,0,0,,
Alliance Care Ltd,1-7939893436,SCL,130 Worcester Road,,,Droitwich,,WR9 8AN,Tel: 01905795086,No ratings yet Rate it yourself - /Services/careproviders/LeaveReview/DefaultView.aspx?id=1-7939893436,0,0,,
Natalie House,1-116988562,SCL,14 Eachway Lane,Rednal,,Birmingham,West Midlands,B45 9LG,Tel: 01214579592,No ratings yet Rate it yourself - /Services/careproviders/LeaveReview/DefaultView.aspx?id=1-116988562,0,0,,
Fordrough Cottage,1-5134518090,SCL,312-314,Alvechurch Road,,Birmingham,West Midlands,B31 3PU,Tel: 01214065035,No ratings yet Rate it yourself - /Services/careproviders/LeaveReview/DefaultView.aspx?id=1-5134518090,0,0,,
Spectrum Days,1-940109194,SCL,Old Coach Road,,,Droitwich,Worcestershire,WR9 8BB,Tel: 07972704378,No ratings yet Rate it yourself - /Services/careproviders/LeaveReview/DefaultView.aspx?id=1-940109194,0,0,,
The Haven Rest Home,1-115740267,SCL,218 Worcester Road,,,Droitwich,Worcestershire,WR9 8AY,Tel: 01905772240,No ratings yet Rate it yourself - /Services/careproviders/LeaveReview/DefaultView.aspx?id=1-115740267,0,0,,
Westmead Residential Care Home,1-124396218,SCL,Westmead Close,Westacre,,Droitwich,Worcestershire,WR9 9LG,Tel: 01905778353,No ratings yet Rate it yourself - /Services/careproviders/LeaveReview/DefaultView.aspx?id=1-124396218,0,0,,