Organisation Name,NACS Code,Organisation Type,Address1,Address2,Address3,Address4,Address5,PostCode,Telephone Number,NHS.UK users rating,Value  (NHS.UK users rating),Banding Classification  (NHS.UK users rating),Car parking (Is there car parking at this organisation?),Disabled access (Disabled access)
Crumble Cottage,1-7778628552,SCL,14 Woodsett Walk,Conisbrough,,Doncaster,,DN12 3BH,Tel: 01709963619,No ratings yet Rate it yourself - /Services/careproviders/LeaveReview/DefaultView.aspx?id=1-7778628552,0,0,,
The Dale Residential Home,1-111417592,SCL,Dale Road,Conisbrough,,Doncaster,South Yorkshire,DN12 3BZ,Tel: 01709862176,No ratings yet Rate it yourself - /Services/careproviders/LeaveReview/DefaultView.aspx?id=1-111417592,0,0,,
Hamilton Court,1-2367994336,SCL,Off Elm Green Lane,Conisbrough,,Doncaster,South Yorkshire,DN12 3JD,Tel: 01709865449,No ratings yet Rate it yourself - /Services/careproviders/LeaveReview/DefaultView.aspx?id=1-2367994336,0,0,,
The Terrace,1-5472804854,SCL,Castle Avenue,Conisbrough,,Doncaster,,DN12 3BT,Tel: 07423434381,No ratings yet Rate it yourself - /Services/careproviders/LeaveReview/DefaultView.aspx?id=1-5472804854,0,0,,
Conan Room,1-3562267203,SCL,The Ivanhoe Centre,Conisbrough,,Doncaster,South Yorkshire,DN12 3JX,Tel: 01709964939,No ratings yet Rate it yourself - /Services/careproviders/LeaveReview/DefaultView.aspx?id=1-3562267203,0,0,,
hcs Supported Living,1-15825978278,SCL,"The Lodge, Off Tickhill Square",Denaby Main,,Doncaster,,DN12 4AR,,No ratings yet Rate it yourself - /Services/careproviders/LeaveReview/DefaultView.aspx?id=1-15825978278,0,0,,
The Limes,1-15350891977,SCL,"1,2,8,10,12,12A Stainton Street",,,Doncaster,,DN12 4AP,,No ratings yet Rate it yourself - /Services/careproviders/LeaveReview/DefaultView.aspx?id=1-15350891977,0,0,,
Rowena House,1-2110989636,SCL,Old Road,Connisborough,,Doncaster,South Yorkshire,DN12 3LX,Tel: 01709862331,No ratings yet Rate it yourself - /Services/careproviders/LeaveReview/DefaultView.aspx?id=1-2110989636,0,0,,
Housing 21 - Swallowdale,1-2018745060,SCL,Jubilee Close,Edlington,,Doncaster,South Yorkshire,DN12 1EX,Tel: 03701924000,No ratings yet Rate it yourself - /Services/careproviders/LeaveReview/DefaultView.aspx?id=1-2018745060,0,0,,
Danum Homecare Ltd,1-800497513,SCL,15 Stable Gardens,Sprotborough,,Doncaster,South Yorkshire,DN5 7LQ,Tel: 01302 857217,1 rating Rate it yourself - /Services/careproviders/LeaveReview/DefaultView.aspx?id=1-800497513,,,,
Newdon Care Services Limited,1-1547222466,SCL,Unit 2-3,"Edlington Lane, Edlington",,Doncaster,South Yorkshire,DN12 1BS,Tel: 01302957582,5 ratings Rate it yourself - /Services/careproviders/LeaveReview/DefaultView.aspx?id=1-1547222466,,,,
Holistic Care 4U,1-5990200024,SCL,Edlington Lane,Edlington,,Doncaster,,DN12 1AB,Tel: 01709206450,No ratings yet Rate it yourself - /Services/careproviders/LeaveReview/DefaultView.aspx?id=1-5990200024,0,0,,
Headingley Park Care Home,1-6284308260,SCL,Headingley Way,Edlington,,Doncaster,South Yorkshire,DN12 1SB,Tel: 01709862542,No ratings yet Rate it yourself - /Services/careproviders/LeaveReview/DefaultView.aspx?id=1-6284308260,0,0,,
Headingley Court Care Home,1-6284308190,SCL,Headingley Way,Edlington,,Doncaster,,DN12 1SB,Tel: 01709866610,No ratings yet Rate it yourself - /Services/careproviders/LeaveReview/DefaultView.aspx?id=1-6284308190,0,0,,
Orchids Care,1-10000792582,SCL,69 Tenter Lane,Warmsworth,,Doncaster,South Yorkshire,DN4 9PE,Tel: 07738718814,No ratings yet Rate it yourself - /Services/careproviders/LeaveReview/DefaultView.aspx?id=1-10000792582,0,0,,
Broomhouse Mews,1-1726648201,SCL,97A Broomhouse Lane,Edlington,,Doncaster,South Yorkshire,DN12 1EH,Tel: 01709863733,No ratings yet Rate it yourself - /Services/careproviders/LeaveReview/DefaultView.aspx?id=1-1726648201,0,0,,
The Pleasance,1-110170888,SCL,Edlington Lane,Edlington,,Doncaster,South Yorkshire,DN12 1PL,Tel: 01709868651,No ratings yet Rate it yourself - /Services/careproviders/LeaveReview/DefaultView.aspx?id=1-110170888,0,0,,
4 Rocksand Drive,1-13815117922,SCL,Edlington,Edlington,,Doncaster,,DN12 1DX,,No ratings yet Rate it yourself - /Services/careproviders/LeaveReview/DefaultView.aspx?id=1-13815117922,0,0,,
Montagu Hall Care Home,1-17982809649,SCL,Harlington Road,,,Mexborough,,S64 0QG,,No ratings yet Rate it yourself - /Services/careproviders/LeaveReview/DefaultView.aspx?id=1-17982809649,0,0,,
Cedars Care Home,1-3534489342,SCL,Cedar Road,Balby,,Doncaster,South Yorkshire,DN4 9HU,Tel: 01302 310668,1 rating Rate it yourself - /Services/careproviders/LeaveReview/DefaultView.aspx?id=1-3534489342,,,,
Community Places-Clifton Drive,1-2795909857,SCL,Clifton Drive,Sprotbrough,,Doncaster,South Yorkshire,DN5 7NL,Tel: 01302788668,No ratings yet Rate it yourself - /Services/careproviders/LeaveReview/DefaultView.aspx?id=1-2795909857,0,0,,
Lifeways Care Limited,1-12993782534,SCL,F13 Mexborough Business Centre,College Road,,Mexborough,,S64 9JP,Tel: 07494788946,No ratings yet Rate it yourself - /Services/careproviders/LeaveReview/DefaultView.aspx?id=1-12993782534,0,0,,
TLC Doncaster,1-4862666681,SCL,Office F9,"Mexborough Business Centre, College Road",,Mexborough,,S64 9JP,Tel: 01302319024,No ratings yet Rate it yourself - /Services/careproviders/LeaveReview/DefaultView.aspx?id=1-4862666681,0,0,,
Elmdale House,1-14622487912,SCL,23 Springwell Lane,,,Doncaster,,DN4 9AD,,No ratings yet Rate it yourself - /Services/careproviders/LeaveReview/DefaultView.aspx?id=1-14622487912,0,0,,
Oakdale House,1-9252396151,SCL,61 Springwell Lane,,,Doncaster,,DN4 9AD,Tel: 07450855500,No ratings yet Rate it yourself - /Services/careproviders/LeaveReview/DefaultView.aspx?id=1-9252396151,0,0,,
Voyage (DCA) Doncaster,1-13166345562,SCL,59 Warmsworth Road,,,Doncaster,,DN4 0RP,Tel: 07773734994,No ratings yet Rate it yourself - /Services/careproviders/LeaveReview/DefaultView.aspx?id=1-13166345562,0,0,,
Buttercup Lodge,1-12126483190,SCL,9 Westmorland Street,,,Doncaster,,DN4 9AQ,Tel: 01302981623,No ratings yet Rate it yourself - /Services/careproviders/LeaveReview/DefaultView.aspx?id=1-12126483190,0,0,,
Ashdale House,1-8400526986,SCL,8 Samuel Street,Balby,,Doncaster,,DN4 9AF,Tel: 07450855500,No ratings yet Rate it yourself - /Services/careproviders/LeaveReview/DefaultView.aspx?id=1-8400526986,0,0,,
Balby,1-118413367,SCL,44 Samuel Street,Balby,,Doncaster,South Yorkshire,DN4 9AF,Tel: 01302859317,No ratings yet Rate it yourself - /Services/careproviders/LeaveReview/DefaultView.aspx?id=1-118413367,0,0,,
Manor House,1-512960702,SCL,Old Hexthorpe,,,Doncaster,South Yorkshire,DN4 0HY,Tel: 01302856616,No ratings yet Rate it yourself - /Services/careproviders/LeaveReview/DefaultView.aspx?id=1-512960702,0,0,,
Lifeways SIL Limited (North East),1-2810586007,SCL,High Road,Balby,,Doncaster,South Yorkshire,DN4 0AB,Tel: 0130 285 6457,No ratings yet Rate it yourself - /Services/careproviders/LeaveReview/DefaultView.aspx?id=1-2810586007,0,0,,
Hexthorpe Cottage,1-8613835037,SCL,17 Old Hexthorpe,,,Doncaster,,DN4 0HX,Tel: 07754646902,No ratings yet Rate it yourself - /Services/careproviders/LeaveReview/DefaultView.aspx?id=1-8613835037,0,0,,
Advanced Caring (Doncaster) Limited,1-10234713801,SCL,Unit 14,"Clayfields Industrial Estate, Tickhill Road",,Doncaster,,DN4 8QG,Tel: 01302811843,1 rating Rate it yourself - /Services/careproviders/LeaveReview/DefaultView.aspx?id=1-10234713801,,,,
BRITZ HEALTH CARE LTD,1-15547041257,SCL,Clayfield House Unit 4,Tickhill Road,,Doncaster,,DN4 8QG,Tel: 07510145600,No ratings yet Rate it yourself - /Services/careproviders/LeaveReview/DefaultView.aspx?id=1-15547041257,0,0,,
Clayfields Business Centre,1-2866375604,SCL,"Unit 1, Clayfields House, Tickhill Road,",Balby,,Doncaster,,DN4 8QG,Tel: 07957440828,No ratings yet Rate it yourself - /Services/careproviders/LeaveReview/DefaultView.aspx?id=1-2866375604,0,0,,
Quarryfields,1-192294311,SCL,Woodfield Road,Balby,,Doncaster,South Yorkshire,DN4 8EP,Tel: 01302 850750,No ratings yet Rate it yourself - /Services/careproviders/LeaveReview/DefaultView.aspx?id=1-192294311,0,0,,
19 Lower Dolcliffe Road,1-7151265389,SCL,19 Lower Dolcliffe Road,,,Mexborough,,S64 9PA,Tel: 01709321526,No ratings yet Rate it yourself - /Services/careproviders/LeaveReview/DefaultView.aspx?id=1-7151265389,0,0,,
Ivy Court,1-2110989725,SCL,Greenfield Lane,Balby,,Doncaster,South Yorkshire,DN4 0PT,Tel: 01302492323,No ratings yet Rate it yourself - /Services/careproviders/LeaveReview/DefaultView.aspx?id=1-2110989725,0,0,,
The Richmond,1-2475424853,SCL,Allendale Road,,,Doncaster,South Yorkshire,DN5 8BS,Tel: 01302782735,No ratings yet Rate it yourself - /Services/careproviders/LeaveReview/DefaultView.aspx?id=1-2475424853,0,0,,
Clarence House Care Home,1-2574756695,SCL,West Road,,,Mexborough,South Yorkshire,S64 9NL,Tel: 01709578889,No ratings yet Rate it yourself - /Services/careproviders/LeaveReview/DefaultView.aspx?id=1-2574756695,0,0,,
Strafford House,1-1464823760,SCL,Off Doncaster Road,Hooton Roberts,,Rotherham,South Yorkshire,S65 4PF,Tel: 01709855796,No ratings yet Rate it yourself - /Services/careproviders/LeaveReview/DefaultView.aspx?id=1-1464823760,0,0,,
Strafford View,1-6431905292,SCL,Doncaster Road,Hooton Roberts,,Rotherham,,S65 4PF,Tel: 07793616670,No ratings yet Rate it yourself - /Services/careproviders/LeaveReview/DefaultView.aspx?id=1-6431905292,0,0,,
Woodfield 24 Care Services,1-1975223043,SCL,"St Catherine's House, Woodfield Park","Tickhill Road, Balby",,Doncaster,South Yorkshire,DN4 8QP,Tel: 01302798000,9 ratings Rate it yourself - /Services/careproviders/LeaveReview/DefaultView.aspx?id=1-1975223043,,,,
Swallow Wood,1-312087389,SCL,Wath Road,Mexborough,,Rotherham,South Yorkshire,S64 9RQ,Tel: 01709571477,No ratings yet Rate it yourself - /Services/careproviders/LeaveReview/DefaultView.aspx?id=1-312087389,0,0,,
Extended Arms Limited,1-17089077001,SCL,83 Orion Way,Balby,,Doncaster,,DN4 8AE,,No ratings yet Rate it yourself - /Services/careproviders/LeaveReview/DefaultView.aspx?id=1-17089077001,0,0,,
Mulberry Manor,1-15080295025,SCL,Wortley Avenue,Swinton,,Mexborough,South Yorkshire,S64 8PT,Tel: 01709261000,No ratings yet Rate it yourself - /Services/careproviders/LeaveReview/DefaultView.aspx?id=1-15080295025,0,0,,
Swinton Grange,1-332852371,SCL,48 Station Street,Swinton,,Mexborough,South Yorkshire,S64 8LU,Tel: 01709 590911,No ratings yet Rate it yourself - /Services/careproviders/LeaveReview/DefaultView.aspx?id=1-332852371,0,0,,
Potters Green,1-17076260315,SCL,Randerson Drive,Kilnhurst,,Mexborough,,S64 5UW,Tel: 01709565777,No ratings yet Rate it yourself - /Services/careproviders/LeaveReview/DefaultView.aspx?id=1-17076260315,0,0,,
Anderby Care Ltd,1-3237424170,SCL,Manvers House,"Pioneer Close, Wath-upon-dearne",,Rotherham,,S63 7JZ,Tel: 07399188026,1 rating Rate it yourself - /Services/careproviders/LeaveReview/DefaultView.aspx?id=1-3237424170,,,,
"Lotus Home Care, Rotherham",1-3518093764,SCL,Manvers & Silkstone House,"Pioneer Close, Wath Upon Dearne",,Rotherham,South Yorkshire,S63 7JZ,Tel: 01709242777,No ratings yet Rate it yourself - /Services/careproviders/LeaveReview/DefaultView.aspx?id=1-3518093764,0,0,,
Tempnur Care,1-10710537206,SCL,"Office 2, Manvers House","Pioneer Close, Wath-upon-dearne",,Rotherham,,S63 7JZ,Tel: 03303411056,No ratings yet Rate it yourself - /Services/careproviders/LeaveReview/DefaultView.aspx?id=1-10710537206,0,0,,
Ammersall Court,1-128571909,SCL,Amersall Road,Scawthorpe,,Doncaster,South Yorkshire,DN5 9GB,Tel: 01302734030,No ratings yet Rate it yourself - /Services/careproviders/LeaveReview/DefaultView.aspx?id=1-128571909,0,0,,
Walsingham Support - Supported Living Doncaster,1-7221753130,SCL,"Room 11, Gresley House",Ten Pound Walk,,Doncaster,,DN4 5HX,Tel: 02083435600,No ratings yet Rate it yourself - /Services/careproviders/LeaveReview/DefaultView.aspx?id=1-7221753130,0,0,,
Age UK Doncaster,1-123864395,SCL,"Unit 1, Ten Pound Walk",,,Doncaster,South Yorkshire,DN4 5HX,Tel: 01302812345,No ratings yet Rate it yourself - /Services/careproviders/LeaveReview/DefaultView.aspx?id=1-123864395,0,0,,
Caring Personal Assistants Ltd - Head Office,1-15274406113,SCL,"Suite 22, Gresley House",Ten Pound Walk,,Doncaster,,DN4 5HX,Tel: 01142138213,2 ratings Rate it yourself - /Services/careproviders/LeaveReview/DefaultView.aspx?id=1-15274406113,,,,
React Homecare Ltd,1-18300155724,SCL,Gresley House,Ten Pound Walk,,Doncaster,,DN4 5HX,,No ratings yet Rate it yourself - /Services/careproviders/LeaveReview/DefaultView.aspx?id=1-18300155724,0,0,,
Prisima Ltd,1-14583931545,SCL,Balby Court,Carr Hill,,Doncaster,South Yorkshire,DN4 8DE,Tel: 01302244480,No ratings yet Rate it yourself - /Services/careproviders/LeaveReview/DefaultView.aspx?id=1-14583931545,0,0,,
Adefey Group Ltd,1-18419707946,SCL,37c 1st Floor D Balby Court,Carr Hill,,Doncaster,,DN4 8DE,Tel: 07361516421,No ratings yet Rate it yourself - /Services/careproviders/LeaveReview/DefaultView.aspx?id=1-18419707946,0,0,,
Deaf Solution Ltd,1-10065481825,SCL,"Office 3, Block D, Balby Court Business Campus",Balby Carr Bank Road,,Doncaster,,DN4 8DE,Tel: 01302244472,No ratings yet Rate it yourself - /Services/careproviders/LeaveReview/DefaultView.aspx?id=1-10065481825,0,0,,
Goodheart Plus Ltd,1-13942878669,SCL,"Office 37D, First Floor D Block, Balby Court Business Campus",Balby Carr Bank,,Doncaster,,DN4 8DE,Tel: 07454767814,No ratings yet Rate it yourself - /Services/careproviders/LeaveReview/DefaultView.aspx?id=1-13942878669,0,0,,
Bluebird Care (Doncaster),1-13943134382,SCL,"Office 7, Ground Floor D Block",Balby Court Business Campus,,Doncaster,,DN4 8DE,,No ratings yet Rate it yourself - /Services/careproviders/LeaveReview/DefaultView.aspx?id=1-13943134382,0,0,,
Balby Care and Home Services Ltd,1-1960481762,SCL,Office 2 Ground Floor Block D,Balby Court Business Campus,,Doncaster,,DN4 8DE,Tel: 08008044302,No ratings yet Rate it yourself - /Services/careproviders/LeaveReview/DefaultView.aspx?id=1-1960481762,0,0,,
Mercy-N Hope Healthcare Limited,1-17934439644,SCL,Balby Court Business Campus,Barlby Carr Bank,,Doncaster,,DN4 8DE,Tel: 07988334406,No ratings yet Rate it yourself - /Services/careproviders/LeaveReview/DefaultView.aspx?id=1-17934439644,0,0,,
Progress House (Kilnhurst),1-132120315,SCL,17 Rix Road,Kilnhurst,,Mexborough,South Yorkshire,S64 5TZ,Tel: 01709 589385,No ratings yet Rate it yourself - /Services/careproviders/LeaveReview/DefaultView.aspx?id=1-132120315,0,0,,
Compassionate Community Care,1-16495470565,SCL,53 Greenwood Road,Kilnhurst,,Mexborough,,S64 5SJ,Tel: 07523651428,No ratings yet Rate it yourself - /Services/careproviders/LeaveReview/DefaultView.aspx?id=1-16495470565,0,0,,
KB4Care Limited,1-13686605024,SCL,"Suite 1-09, Cussins House",22-28 Wood Street,,Doncaster,,DN1 3LW,Tel: 07920022354,No ratings yet Rate it yourself - /Services/careproviders/LeaveReview/DefaultView.aspx?id=1-13686605024,0,0,,
Bloom Lilly Healthcare Limited,1-11760286812,SCL,22-28 Wood Street,,,Doncaster,,DN1 3LW,Tel: 077579824702,3 ratings Rate it yourself - /Services/careproviders/LeaveReview/DefaultView.aspx?id=1-11760286812,,,,
Chids Healthcare Solutions Ltd,1-13640381958,SCL,39 Conyers Road,,,Doncaster,,DN5 9SU,Tel: 07305459729,No ratings yet Rate it yourself - /Services/careproviders/LeaveReview/DefaultView.aspx?id=1-13640381958,0,0,,
Dearne Valley Care Centre,1-129132569,SCL,Furlong Road,Bolton on Dearne,,Rotherham,South Yorkshire,S63 9PY,Tel: 01709893435,No ratings yet Rate it yourself - /Services/careproviders/LeaveReview/DefaultView.aspx?id=1-129132569,0,0,,
LEELOVES 2 CARE LIMITED,1-16335778488,SCL,73 South Street,Highfields,,Doncaster,,DN6 7JL,Tel: 07482428787,No ratings yet Rate it yourself - /Services/careproviders/LeaveReview/DefaultView.aspx?id=1-16335778488,0,0,,
Inspired Day Care,1-14426179075,SCL,Inspired House,Chequer Road,,Doncaster,,DN1 2AA,Tel: 07442152581,No ratings yet Rate it yourself - /Services/careproviders/LeaveReview/DefaultView.aspx?id=1-14426179075,0,0,,
Cristal Care,1-10488977631,SCL,Proaktive House,Sidings Court,,Doncaster,,DN4 5NU,Tel: 01302857433,No ratings yet Rate it yourself - /Services/careproviders/LeaveReview/DefaultView.aspx?id=1-10488977631,0,0,,
Lifeways Community Care (Doncaster),1-2644164628,SCL,"Unit 2, Don House","Richmond Business Park, Sidings Court",,Doncaster,South Yorkshire,DN4 5NL,Tel: 01302344255,No ratings yet Rate it yourself - /Services/careproviders/LeaveReview/DefaultView.aspx?id=1-2644164628,0,0,,
Living Ambitions Limited (Doncaster),1-2607493461,SCL,"Unit 2, Don House, Richmond Business Park",Sidings Court,,Doncaster,South Yorkshire,DN4 5NL,Tel: 01302344255,No ratings yet Rate it yourself - /Services/careproviders/LeaveReview/DefaultView.aspx?id=1-2607493461,0,0,,
MB Healthcare Staffing Limited,1-18679007097,SCL,3 Nidd House,"Richmond Business Park, Sidings Court",,Doncaster,,DN4 5NL,Tel: 01302323957,No ratings yet Rate it yourself - /Services/careproviders/LeaveReview/DefaultView.aspx?id=1-18679007097,0,0,,
Vermuyden Care,1-8761652315,SCL,Danum House,6a South Parade,,Doncaster,,DN1 2DY,Tel: 01302460000,1 rating Rate it yourself - /Services/careproviders/LeaveReview/DefaultView.aspx?id=1-8761652315,,,,
Carolight Care Services Ltd,1-18246901301,SCL,3 Cavendish Court,South Parade,,Doncaster,,DN1 2DJ,,No ratings yet Rate it yourself - /Services/careproviders/LeaveReview/DefaultView.aspx?id=1-18246901301,0,0,,
Kairos Care Services Ltd,1-14333106624,SCL,8 Cavendish Court,South Parade,,Doncaster,South Yorkshire,DN1 2DJ,Tel: 07960648349,No ratings yet Rate it yourself - /Services/careproviders/LeaveReview/DefaultView.aspx?id=1-14333106624,0,0,,
Prospect Health Living Care Services Limited,1-14716902422,SCL,9 Lincoln Gardens,Goldthorpe,,Rotherham,,S63 9AH,,No ratings yet Rate it yourself - /Services/careproviders/LeaveReview/DefaultView.aspx?id=1-14716902422,0,0,,
Hope Health Kare Limited,1-9670948958,SCL,"Office No. 3, 83 Copley Road",,,Doncaster,,DN1 2QP,Tel: 01302431944,No ratings yet Rate it yourself - /Services/careproviders/LeaveReview/DefaultView.aspx?id=1-9670948958,0,0,,
Dearne Hall,1-10758359358,SCL,St. Andrews Square,Bolton-upon-Dearne,,Rotherham,,S63 8BA,Tel: 01709882090,No ratings yet Rate it yourself - /Services/careproviders/LeaveReview/DefaultView.aspx?id=1-10758359358,0,0,,
RGM Service Company Limited T/A Home Instead Senior Care (Doncaster),1-4306883165,SCL,Second floor Club Doncaster Enterprise Zone,Keepmoat Stadium Stadium,,Doncaster,,DN4 5JW,Tel: 01302369655,No ratings yet Rate it yourself - /Services/careproviders/LeaveReview/DefaultView.aspx?id=1-4306883165,0,0,,
Bennethorpe House,1-179683062,SCL,68 Bennetthorpe,,,Doncaster,,DN2 6AD,Tel: 01302367672,No ratings yet Rate it yourself - /Services/careproviders/LeaveReview/DefaultView.aspx?id=1-179683062,0,0,,
Chapel Garth EMI Residential Home,1-140668818,SCL,Central Avenue,Bentley,,Doncaster,South Yorkshire,DN5 0AR,Tel: 01302872147,No ratings yet Rate it yourself - /Services/careproviders/LeaveReview/DefaultView.aspx?id=1-140668818,0,0,,
St Mary's Nursing Home,1-4254763811,SCL,101 Thorne Road,,,Doncaster,South Yorkshire,DN1 2JT,Tel: 01302342639,No ratings yet Rate it yourself - /Services/careproviders/LeaveReview/DefaultView.aspx?id=1-4254763811,0,0,,
Albany House - Doncaster,1-112774876,SCL,5 Woodlands Road,Woodlands,,Doncaster,South Yorkshire,DN6 7JX,Tel: 01302723203,No ratings yet Rate it yourself - /Services/careproviders/LeaveReview/DefaultView.aspx?id=1-112774876,0,0,,
Neville Lodge,1-10596812215,SCL,109 Thorne Road,,,Doncaster,,DN2 5BE,Tel: 07583635516,No ratings yet Rate it yourself - /Services/careproviders/LeaveReview/DefaultView.aspx?id=1-10596812215,0,0,,
Thorndene Residential Care Home,1-6640083813,SCL,107 Thorne Road,,,Doncaster,South Yorkshire,DN2 5BE,Tel: 01302327307,No ratings yet Rate it yourself - /Services/careproviders/LeaveReview/DefaultView.aspx?id=1-6640083813,0,0,,
Amphion View Limited,1-156469457,SCL,17-19 Avenue Road,,,Doncaster,South Yorkshire,DN2 4AQ,Tel: 01302595959,No ratings yet Rate it yourself - /Services/careproviders/LeaveReview/DefaultView.aspx?id=1-156469457,0,0,,
Hamilton Lodge,1-1470126058,SCL,Carr House Road,,,Doncaster,South Yorkshire,DN4 5HP,Tel: 01302556046,No ratings yet Rate it yourself - /Services/careproviders/LeaveReview/DefaultView.aspx?id=1-1470126058,0,0,,
The Grove Care Centre - Thurnscoe,1-129132365,SCL,Bridge Lane,Thurnscoe,,Rotherham,South Yorkshire,S63 0SN,Tel: 01709895424,No ratings yet Rate it yourself - /Services/careproviders/LeaveReview/DefaultView.aspx?id=1-129132365,0,0,,
Avalon Doncaster Services,1-5300061691,SCL,Avalon Offices (to the rear of),"113, Thorne Road",,Doncaster,,DN2 5BQ,,No ratings yet Rate it yourself - /Services/careproviders/LeaveReview/DefaultView.aspx?id=1-5300061691,0,0,,
Anchor House - Doncaster,1-119309335,SCL,11 Avenue Road,,,Doncaster,South Yorkshire,DN2 4AH,Tel: 01302327004,No ratings yet Rate it yourself - /Services/careproviders/LeaveReview/DefaultView.aspx?id=1-119309335,0,0,,
Dearne Valley Business Park,1-18686054469,SCL,Dearne Valley Business Centre Office 2,"Coronation Road, Wath-upon-dearne",,Rotherham,,S63 7GE,Tel: 07818761075,No ratings yet Rate it yourself - /Services/careproviders/LeaveReview/DefaultView.aspx?id=1-18686054469,0,0,,
The Beeches,1-242047707,SCL,Carr Road,Wath Upon Dearne,,Rotherham,South Yorkshire,S63 7AA,Tel: 01709761803,No ratings yet Rate it yourself - /Services/careproviders/LeaveReview/DefaultView.aspx?id=1-242047707,0,0,,
Town Moor House,1-118066998,SCL,1/2 Town Moor Avenue,,,Doncaster,South Yorkshire,DN2 6BL,Tel: 01302 368573,No ratings yet Rate it yourself - /Services/careproviders/LeaveReview/DefaultView.aspx?id=1-118066998,0,0,,
Doncaster Crisis Accommodation and Helpline,1-130502862,SCL,1 Imperial Crescent,Townmoor,,Doncaster,South Yorkshire,DN2 5BU,Tel: 01302329491,No ratings yet Rate it yourself - /Services/careproviders/LeaveReview/DefaultView.aspx?id=1-130502862,0,0,,
Sandygate Residential Care Home,1-242012192,SCL,57 Sandygate,Wath Upon Dearne,,Rotherham,South Yorkshire,S63 7LU,Tel: 01709877463,No ratings yet Rate it yourself - /Services/careproviders/LeaveReview/DefaultView.aspx?id=1-242012192,0,0,,
Human Support Group Limited - Doncaster,1-2006269158,SCL,Approach House,"Great North Road, Woodlands",,Doncaster,,DN6 7SU,Tel: 01302326136,No ratings yet Rate it yourself - /Services/careproviders/LeaveReview/DefaultView.aspx?id=1-2006269158,0,0,,
Alexandra Nursing & Residential Home,1-2274807017,SCL,Doncaster Road,Thrybergh,,Rotherham,,S65 4AD,Tel: 01709850844,No ratings yet Rate it yourself - /Services/careproviders/LeaveReview/DefaultView.aspx?id=1-2274807017,0,0,,
Magnet Court,1-2122625857,SCL,1 Magnet Court,"Victoria Road, Bentley",,Doncaster,South Yorkshire,DN5 0HP,Tel: 01302 822522,No ratings yet Rate it yourself - /Services/careproviders/LeaveReview/DefaultView.aspx?id=1-2122625857,0,0,,
Ivy Lodge,1-116570494,SCL,Welfare Road,Thurnscoe,,Rotherham,South Yorkshire,S63 0JZ,Tel: 01709888500,No ratings yet Rate it yourself - /Services/careproviders/LeaveReview/DefaultView.aspx?id=1-116570494,0,0,,
Valley Care Barnsley & Rotherham,1-18938517099,SCL,2a,"Moor Road, Wath-upon-dearne",,Rotherham,,S63 7RU,Tel: 01143082577,No ratings yet Rate it yourself - /Services/careproviders/LeaveReview/DefaultView.aspx?id=1-18938517099,0,0,,
Dearnlea Park Residential Care Home,1-4131497092,SCL,Park Road,Thurnscoe,,Rotherham,South Yorkshire,S63 0TG,Tel: 01709893094,No ratings yet Rate it yourself - /Services/careproviders/LeaveReview/DefaultView.aspx?id=1-4131497092,0,0,,
Road Life Health Care Ltd,1-14588107663,SCL,Unit 9 Wath Plaza,"2 Sandygate, Wath-upon-dearne",,Rotherham,,S63 7LW,Tel: 07827794422,No ratings yet Rate it yourself - /Services/careproviders/LeaveReview/DefaultView.aspx?id=1-14588107663,0,0,,