Organisation Name,NACS Code,Organisation Type,Address1,Address2,Address3,Address4,Address5,PostCode,Telephone Number,NHS.UK users rating,Value  (NHS.UK users rating),Banding Classification  (NHS.UK users rating),Car parking (Is there car parking at this organisation?),Disabled access (Disabled access)
Hardy Drive,1-119188078,SCL,23 Hardy Drive,,,Royston,Hertfordshire,SG8 5LZ,Tel: 01763243684,No ratings yet Rate it yourself - /Services/careproviders/LeaveReview/DefaultView.aspx?id=1-119188078,0,0,,
St George's Nursing Home,1-13082303046,SCL,42 Kneesworth Street,,,Royston,Hertfordshire,SG8 5AQ,Tel: 01763242243,No ratings yet Rate it yourself - /Services/careproviders/LeaveReview/DefaultView.aspx?id=1-13082303046,0,0,,
Wholehearted Home Care,1-14500136449,SCL,6 Pightle Close,,,Royston,,SG8 5AZ,Tel: 07365068797,No ratings yet Rate it yourself - /Services/careproviders/LeaveReview/DefaultView.aspx?id=1-14500136449,0,0,,
Your Life (Royston),1-310598811,SCL,Goodes Court,Baldock Road,,Royston,Hertfordshire,SG8 5FF,Tel: 01763256810,No ratings yet Rate it yourself - /Services/careproviders/LeaveReview/DefaultView.aspx?id=1-310598811,0,0,,
Richard Cox House,1-118542165,SCL,Dog Kennel Lane,,,Royston,Hertfordshire,SG8 7AB,Tel: 01763249111,No ratings yet Rate it yourself - /Services/careproviders/LeaveReview/DefaultView.aspx?id=1-118542165,0,0,,
Aurora Orchard Manor Transition Service,1-17882727358,SCL,Manor Road,Meldreth,,Royston,Hertfordshire,SG8 6LG,Tel: 01763268000,No ratings yet Rate it yourself - /Services/careproviders/LeaveReview/DefaultView.aspx?id=1-17882727358,0,0,,
Maycroft Care Home,1-393307254,SCL,73 High Street,Meldreth,,Royston,Cambridgeshire,SG8 6LB,Tel: 01763260217,No ratings yet Rate it yourself - /Services/careproviders/LeaveReview/DefaultView.aspx?id=1-393307254,0,0,,
CHS Homecare (Domiciliary Care Agency),1-123050589,SCL,Moorlands Court,The Moor,,Melbourn,Hertfordshire,SG8 6FH,Tel: 01763260564,No ratings yet Rate it yourself - /Services/careproviders/LeaveReview/DefaultView.aspx?id=1-123050589,0,0,,
Melbourn Springs Care Home,1-8740102925,SCL,Hyacinth Drive,Melbourn,,Royston,,SG8 6FY,Tel: 01763261974,2 ratings Rate it yourself - /Services/careproviders/LeaveReview/DefaultView.aspx?id=1-8740102925,,,,
Southwell Court,1-6825580794,SCL,Hinkins Close,Melbourn,,Royston,Cambridgeshire,SG8 6JL,Tel: 01763750006,No ratings yet Rate it yourself - /Services/careproviders/LeaveReview/DefaultView.aspx?id=1-6825580794,0,0,,
Bramley Avenue,1-2964143860,SCL,73 Bramley Avenue,Melbourn,,Royston,Hertfordshire,SG8 6HG,Tel: 01763261682,No ratings yet Rate it yourself - /Services/careproviders/LeaveReview/DefaultView.aspx?id=1-2964143860,0,0,,
Margaret House,1-132000034,SCL,Church End,Barley,,Royston,Cambridgeshire,SG8 8JS,Tel: 01763 848272,No ratings yet Rate it yourself - /Services/careproviders/LeaveReview/DefaultView.aspx?id=1-132000034,0,0,,
Riversands Healthcare Ltd,1-15927260955,SCL,34 High Street,Sutton,,Sandy,,SG19 2NE,Tel: 01767835365,No ratings yet Rate it yourself - /Services/careproviders/LeaveReview/DefaultView.aspx?id=1-15927260955,0,0,,
Potton View,1-5683394335,SCL,"Mill Hill, Potton Road",Gamlingay,,Sandy,,SG19 3LW,Tel: 01767654866,No ratings yet Rate it yourself - /Services/careproviders/LeaveReview/DefaultView.aspx?id=1-5683394335,0,0,,
Exclusive Care Ltd,1-6510507259,SCL,"Suite F, 15 Royston Road",,,Baldock,,SG7 6NW,Tel: 01438310108,No ratings yet Rate it yourself - /Services/careproviders/LeaveReview/DefaultView.aspx?id=1-6510507259,0,0,,
Penrose Court,1-5810948543,SCL,Delius Road,,,Biggleswade,,SG18 8UA,Tel: 01767777000,No ratings yet Rate it yourself - /Services/careproviders/LeaveReview/DefaultView.aspx?id=1-5810948543,0,0,,
Home Meadow,1-121919909,SCL,Comberton Road,,,Toft,Cambridgeshire,CB23 2RY,Tel: 01223263282,No ratings yet Rate it yourself - /Services/careproviders/LeaveReview/DefaultView.aspx?id=1-121919909,0,0,,
Ray Care Services,1-9140231603,SCL,24 Queens Close,Harston,,Cambridge,,CB22 7QL,Tel: 01223873231,No ratings yet Rate it yourself - /Services/careproviders/LeaveReview/DefaultView.aspx?id=1-9140231603,0,0,,
Pemdale,1-252073648,SCL,26A Nursery Close,,,Potton,Bedfordshire,SG19 2QE,Tel: 01767262515,No ratings yet Rate it yourself - /Services/careproviders/LeaveReview/DefaultView.aspx?id=1-252073648,0,0,,
A Quality Care Service Limited,1-6521134593,SCL,5 Woburn Place,Duxford,,Cambridge,Cambridgeshire,CB22 4QJ,Tel: 01223830257,No ratings yet Rate it yourself - /Services/careproviders/LeaveReview/DefaultView.aspx?id=1-6521134593,0,0,,
Mantles Court,1-11910770257,SCL,115 London Road,,,Biggleswade,,SG18 8EF,Tel: 01767304701,No ratings yet Rate it yourself - /Services/careproviders/LeaveReview/DefaultView.aspx?id=1-11910770257,0,0,,
Potton House Care Home,1-137524320,SCL,Potton Road,,,Biggleswade,Bedfordshire,SG18 0EL,Tel: 01767 317289,No ratings yet Rate it yourself - /Services/careproviders/LeaveReview/DefaultView.aspx?id=1-137524320,0,0,,
YourLife (Baldock),1-17974116889,SCL,Norton Place,74 Icknield Way,,Baldock,,SG7 5AN,,No ratings yet Rate it yourself - /Services/careproviders/LeaveReview/DefaultView.aspx?id=1-17974116889,0,0,,
Cera Mill View,1-14136479184,SCL,Mill View,"St. Edmunds Way, Hauxton",,Cambridge,,CB22 5GA,Tel: 01223873316,No ratings yet Rate it yourself - /Services/careproviders/LeaveReview/DefaultView.aspx?id=1-14136479184,0,0,,
Providence Court,1-118542149,SCL,Providence Way,,,Baldock,Hertfordshire,SG7 6TT,Tel: 01462490870,No ratings yet Rate it yourself - /Services/careproviders/LeaveReview/DefaultView.aspx?id=1-118542149,0,0,,
Osbourne Court,1-16524203997,SCL,Park Drive,,,Baldock,Hertfordshire,SG7 6EN,Tel: 01462896966,No ratings yet Rate it yourself - /Services/careproviders/LeaveReview/DefaultView.aspx?id=1-16524203997,0,0,,
ICRIT Healthcare Limited (Herts),1-15102913711,SCL,"Office 9, Units 11 -12,","Baldock Industrial Estate, London Road",,Baldock,,SG7 6NG,Tel: 07943739379,No ratings yet Rate it yourself - /Services/careproviders/LeaveReview/DefaultView.aspx?id=1-15102913711,0,0,,
2 Crab Lane,1-13936924815,SCL,2 Crab Lane,,,Biggleswade,,SG18 0LN,Tel: 07971106629,No ratings yet Rate it yourself - /Services/careproviders/LeaveReview/DefaultView.aspx?id=1-13936924815,0,0,,
Baldock - The Rowans,1-10042502639,SCL,2 The Rowans,,,Baldock,,SG7 6HJ,Tel: 01462490634,No ratings yet Rate it yourself - /Services/careproviders/LeaveReview/DefaultView.aspx?id=1-10042502639,0,0,,
Sagecare (Biggleswade),1-113531639,SCL,"Ground Floor Office, 1 Connections House",Station Road,,Biggleswade,,SG18 8AL,Tel: 01767317311,No ratings yet Rate it yourself - /Services/careproviders/LeaveReview/DefaultView.aspx?id=1-113531639,0,0,,
Burleigh House Residential Home,1-125098165,SCL,Burleigh House,41 Letchworth Road,,Baldock,Hertfordshire,SG7 6AA,Tel: 01462 893216,No ratings yet Rate it yourself - /Services/careproviders/LeaveReview/DefaultView.aspx?id=1-125098165,0,0,,
Trembaths,1-117976837,SCL,Talbot Way,,,Letchworth Garden City,Hertfordshire,SG6 1UA,Tel: 01462481694,No ratings yet Rate it yourself - /Services/careproviders/LeaveReview/DefaultView.aspx?id=1-117976837,0,0,,
Knightingles Healthcare Bedfordshire Limited,1-4606227639,SCL,Bridge House,27-29 High Street,,Biggleswade,Bedfordshire,SG18 0JE,Tel: 07717064436,1 rating Rate it yourself - /Services/careproviders/LeaveReview/DefaultView.aspx?id=1-4606227639,,,,
Caremark Cambridge and South Cambridgeshire,1-5801539172,SCL,"Unit 7, Grange Park",Broadway,,Cambridge,Cambridgeshire,CB23 2TA,Tel: 01223 778818,2 ratings Rate it yourself - /Services/careproviders/LeaveReview/DefaultView.aspx?id=1-5801539172,,,,
Beaumont Park Nursing and Residential Home,1-121919707,SCL,Shortmead Street,,,Biggleswade,Bedfordshire,SG18 0AT,Tel: 01767313131,1 rating Rate it yourself - /Services/careproviders/LeaveReview/DefaultView.aspx?id=1-121919707,,,,
Hales Group Limited - Letchworth,1-1209416896,SCL,608 Jubilee Trading Estate,"Jubilee Road, Letchworth",,Letchworth Garden City,,SG6 1NE,Tel: 01438765715,No ratings yet Rate it yourself - /Services/careproviders/LeaveReview/DefaultView.aspx?id=1-1209416896,0,0,,
DX Caring Services,1-9676435907,SCL,"608 Jubilee Trading Estate, Jubilee Road",,,Letchworth Garden City,,SG6 1NE,Tel: 01462677770,No ratings yet Rate it yourself - /Services/careproviders/LeaveReview/DefaultView.aspx?id=1-9676435907,0,0,,
Holistic Healthcare Hertfordshire,1-18949308982,SCL,608 Jubilee Trading Estate,Jubilee Road,,Letchworth Garden City,,SG6 1NE,Tel: 07838702816,No ratings yet Rate it yourself - /Services/careproviders/LeaveReview/DefaultView.aspx?id=1-18949308982,0,0,,
Buntingford,1-1829473970,SCL,62 Vicarage Road,,,Buntingford,Hertfordshire,SG9 9BA,Tel: 01763273191,No ratings yet Rate it yourself - /Services/careproviders/LeaveReview/DefaultView.aspx?id=1-1829473970,0,0,,
HF Trust - Hollycroft,1-120702231,SCL,90 Church Street,,,Langford,Bedfordshire,SG18 9QA,Tel: 01462701273,No ratings yet Rate it yourself - /Services/careproviders/LeaveReview/DefaultView.aspx?id=1-120702231,0,0,,
Bluebird Care (Stevenage & North Herts),1-2929389277,SCL,"Venture House, Office 6",Fifth Avenue,,Letchworth Garden City,Hertfordshire,SG6 2HW,Tel: 01462676555,No ratings yet Rate it yourself - /Services/careproviders/LeaveReview/DefaultView.aspx?id=1-2929389277,0,0,,
Home Instead Senior Care (Stevenage & North Herts),1-2371987179,SCL,Venture House,Fifth Avenue,,Letchworth Garden City,Hertfordshire,SG6 2HW,Tel: 01462 600462,No ratings yet Rate it yourself - /Services/careproviders/LeaveReview/DefaultView.aspx?id=1-2371987179,0,0,,
The Doting Carers Ltd,1-12154814465,SCL,Devonshire Business Centre,Works Road,,Letchworth Garden City,Hertfordshire,SG6 1GJ,Tel: 01462488215,1 rating Rate it yourself - /Services/careproviders/LeaveReview/DefaultView.aspx?id=1-12154814465,,,,
Hand in Hands,1-1724411627,SCL,"Unit 5, Devonshire Business Centre",Works Road,,Letchworth,Hertfordshire,SG6 1GJ,Tel: 01462222400,No ratings yet Rate it yourself - /Services/careproviders/LeaveReview/DefaultView.aspx?id=1-1724411627,0,0,,
Compassion PLUS Healthcare,1-5937564351,SCL,Devonshire Business Centre,Works Road,,Letchworth Garden City,Hertfordshire,SG6 1GJ,Tel: 01462416101,No ratings yet Rate it yourself - /Services/careproviders/LeaveReview/DefaultView.aspx?id=1-5937564351,0,0,,
Abacus Care & Support,1-8809577412,SCL,"Head Office, Devonshire Business Centre",Works Road,,Letchworth Garden City,,SG6 1GJ,Tel: 02071001680,No ratings yet Rate it yourself - /Services/careproviders/LeaveReview/DefaultView.aspx?id=1-8809577412,0,0,,
Multi-Care Community Services North Hertfordshire Ltd,1-12586250040,SCL,Devonshire Business Centre,Works Road,,Letchworth Garden City,Hertfordshire,SG6 1GJ,Tel: 01462488225,No ratings yet Rate it yourself - /Services/careproviders/LeaveReview/DefaultView.aspx?id=1-12586250040,0,0,,
Baycroft Fairfield,1-17708769137,SCL,Baycroft Fairfield,"Hitchin Road, Fairfield",,Hitchin,,SG5 4SW,Tel: 02084214190,No ratings yet Rate it yourself - /Services/careproviders/LeaveReview/DefaultView.aspx?id=1-17708769137,0,0,,
Caremark (North Herts & Stevenage),1-708980096,SCL,A(2) Arden Press House,Arden Press Way,,Letchworth Garden City,Hertfordshire,SG6 1LH,Tel: 01462708714,No ratings yet Rate it yourself - /Services/careproviders/LeaveReview/DefaultView.aspx?id=1-708980096,0,0,,
Chase House Limited,1-141541186,SCL,House Lane,,,Arlesey,Bedfordshire,SG15 6YA,Tel: 01462731276,1 rating Rate it yourself - /Services/careproviders/LeaveReview/DefaultView.aspx?id=1-141541186,,,,
Turning Point - Brickfields Cottage,1-132794758,SCL,Hare Street Road,,,Buntingford,Hertfordshire,SG9 0AB,Tel: 01763289230,No ratings yet Rate it yourself - /Services/careproviders/LeaveReview/DefaultView.aspx?id=1-132794758,0,0,,
Garden City Court,1-2238558165,SCL,Whiteway,,,Letchworth Garden City,Hertfordshire,SG6 2PP,Tel: 01462473100,No ratings yet Rate it yourself - /Services/careproviders/LeaveReview/DefaultView.aspx?id=1-2238558165,0,0,,
The White House Care Home,1-14239622698,SCL,Gillison Close,,,Letchworth Garden City,Hertfordshire,SG6 1QL,Tel: 01462533777,No ratings yet Rate it yourself - /Services/careproviders/LeaveReview/DefaultView.aspx?id=1-14239622698,0,0,,
The Cambridgeshire Care Home,1-3086939375,SCL,176-178 Cambridge Road,Great Shelford,,Cambridge,Cambridgeshire,CB22 5JU,Tel: 08082235550,No ratings yet Rate it yourself - /Services/careproviders/LeaveReview/DefaultView.aspx?id=1-3086939375,0,0,,
Windmill Lodge Ltd,1-11856580467,SCL,"2 Windmill Hill,",London Road,,Buntingford,,SG9 9JP,Tel: 01763273935,No ratings yet Rate it yourself - /Services/careproviders/LeaveReview/DefaultView.aspx?id=1-11856580467,0,0,,
City Care Services,1-396095222,SCL,Kingfisher House,"High Green, Great Shelford",,Cambridge,Cambridgeshire,CB22 5EG,Tel: 01223842100,No ratings yet Rate it yourself - /Services/careproviders/LeaveReview/DefaultView.aspx?id=1-396095222,0,0,,
Trust Homecare Solution Limited,1-4580845919,SCL,26 Broad Street,Great Cambourne,,Cambridge,,CB23 6HJ,Tel: 01223597842,No ratings yet Rate it yourself - /Services/careproviders/LeaveReview/DefaultView.aspx?id=1-4580845919,0,0,,
Lannock Manor Mental Health Ltd,1-2432492683,SCL,Lannock Manor,Hitchin Road,,Hitchin,Hertfordshire,SG4 7EE,Tel: 01462 790850,No ratings yet Rate it yourself - /Services/careproviders/LeaveReview/DefaultView.aspx?id=1-2432492683,0,0,,
Helping Hands Letchworth,1-6903991121,SCL,9,Leys Avenue,,Letchworth Garden City,,SG6 3EA,Tel: 01462530924,No ratings yet Rate it yourself - /Services/careproviders/LeaveReview/DefaultView.aspx?id=1-6903991121,0,0,,
Holistic Healthcare Cambridge,1-10586286798,SCL,Regus House,,,Cambridge,,CB23 6DP,Tel: 07838702816,No ratings yet Rate it yourself - /Services/careproviders/LeaveReview/DefaultView.aspx?id=1-10586286798,0,0,,
Clarity Care Providers Ltd,1-18319668626,SCL,Regus House,"1010 Cambourne Business Park, Cambourne",,Cambridge,,CB23 6DP,Tel: 07873587542,No ratings yet Rate it yourself - /Services/careproviders/LeaveReview/DefaultView.aspx?id=1-18319668626,0,0,,
Jome Healthcare,1-18344408310,SCL,"Jome Healthcare Ltd, Regus House","1010 Cambourne Business Park, Cambourne",,Cambridge,,CB23 6DP,Tel: 02030924672,No ratings yet Rate it yourself - /Services/careproviders/LeaveReview/DefaultView.aspx?id=1-18344408310,0,0,,
Heriitage Care Ltd,1-18631929663,SCL,Regus House,"1010 Cambourne Business Park, Cambourne",,Cambridge,,CB23 6DP,Tel: 07804281380,No ratings yet Rate it yourself - /Services/careproviders/LeaveReview/DefaultView.aspx?id=1-18631929663,0,0,,
Cambridge Office,1-15231658392,SCL,Regus House,,,Cambridge,,CB23 6DP,Tel: 07483341265,No ratings yet Rate it yourself - /Services/careproviders/LeaveReview/DefaultView.aspx?id=1-15231658392,0,0,,
Blue Lotus Healthcare Cambridge,1-16547046416,SCL,Regus House,,,Cambridge,,CB23 6DP,Tel: 07899828866,No ratings yet Rate it yourself - /Services/careproviders/LeaveReview/DefaultView.aspx?id=1-16547046416,0,0,,
Northcrest Healthcare Limited,1-14238206037,SCL,Regus House,,,Cambridge,,CB23 6DP,Tel: 03333395739,No ratings yet Rate it yourself - /Services/careproviders/LeaveReview/DefaultView.aspx?id=1-14238206037,0,0,,
ELMS Health Solution,1-4700545529,SCL,"Regus House, 1010 Cambourne Business Park",Cambourne,,Cambridge,Cambridgeshire,CB23 6DP,Tel: 01223751700,1 rating Rate it yourself - /Services/careproviders/LeaveReview/DefaultView.aspx?id=1-4700545529,,,,
Heart Care Services Ltd,1-15842469542,SCL,Regus House,,,Cambridge,,CB23 6DP,Tel: 07731821195,No ratings yet Rate it yourself - /Services/careproviders/LeaveReview/DefaultView.aspx?id=1-15842469542,0,0,,
Servoca Complex Care - Cambridge,1-15862138238,SCL,Regus House,,,Cambridge,,CB23 6DP,Tel: 07423693942,No ratings yet Rate it yourself - /Services/careproviders/LeaveReview/DefaultView.aspx?id=1-15862138238,0,0,,
Destiny Intergrated Care Cambridge Branch,1-11170126901,SCL,1010 Cambourne Business Park,Great Cambourne,,Cambridge,,CB23 6DP,Tel: 07763534261,No ratings yet Rate it yourself - /Services/careproviders/LeaveReview/DefaultView.aspx?id=1-11170126901,0,0,,
Careuk247 Home Care Cambridgeshire,1-6721626964,SCL,Regus House,,,Cambridge,,CB23 6DP,Tel: 01480504247,No ratings yet Rate it yourself - /Services/careproviders/LeaveReview/DefaultView.aspx?id=1-6721626964,0,0,,
Gifted Quality Care Main Office,1-12480515456,SCL,Regus House,,,Cambridge,,CB23 6DP,Tel: 01223901886,No ratings yet Rate it yourself - /Services/careproviders/LeaveReview/DefaultView.aspx?id=1-12480515456,0,0,,
Gracefield Nursing Home and Residential Care Home,1-118334627,SCL,St Neots Road,Dry Drayton,,Cambridge,Cambridgeshire,CB23 8AY,Tel: 01954210833,1 rating Rate it yourself - /Services/careproviders/LeaveReview/DefaultView.aspx?id=1-118334627,,,,
Layston Grove Care Home,1-13693158947,SCL,Keen Avenue,,,Buntingford,Hertfordshire,SG9 9SU,Tel: 01763274327,No ratings yet Rate it yourself - /Services/careproviders/LeaveReview/DefaultView.aspx?id=1-13693158947,0,0,,
CareRooms Head Office,1-10296569001,SCL,1010 Regus Cambourne,Cambourne,,Cambridge,,CB23 6DW,,No ratings yet Rate it yourself - /Services/careproviders/LeaveReview/DefaultView.aspx?id=1-10296569001,0,0,,
High Street Sandy,1-344173174,SCL,87 High Street,,,Sandy,Bedfordshire,SG19 1AL,Tel: 01767680325,No ratings yet Rate it yourself - /Services/careproviders/LeaveReview/DefaultView.aspx?id=1-344173174,0,0,,
Manor Farm,1-121852422,SCL,Pittsdean Road,Abbotsley,,St Neots,Cambridgeshire,PE19 6UW,Tel: 01767679900,No ratings yet Rate it yourself - /Services/careproviders/LeaveReview/DefaultView.aspx?id=1-121852422,0,0,,
First Assure Care Ltd,1-12221325940,SCL,20 Byron Square,Trumpington,,Cambridge,,CB2 9JJ,Tel: 07899298354,No ratings yet Rate it yourself - /Services/careproviders/LeaveReview/DefaultView.aspx?id=1-12221325940,0,0,,
The Limes Care Home,1-14935070064,SCL,85 High Street,,,Henlow,Bedfordshire,SG16 6AB,Tel: 01462811028,No ratings yet Rate it yourself - /Services/careproviders/LeaveReview/DefaultView.aspx?id=1-14935070064,0,0,,
Bircham House,1-15273720606,SCL,191 High Street,Sawston,,Cambridge,,CB22 3HE,Tel: 07974264321,No ratings yet Rate it yourself - /Services/careproviders/LeaveReview/DefaultView.aspx?id=1-15273720606,0,0,,
Multi-Care Community Services Bedfordshire Ltd,1-16495359070,SCL,"Suite 6, Belfry Court",High Street,,Sandy,,SG19 1JR,Tel: 01767843243,No ratings yet Rate it yourself - /Services/careproviders/LeaveReview/DefaultView.aspx?id=1-16495359070,0,0,,
Orchard House Residential Care Home,1-329090225,SCL,191 High Street,,,Sawston,Cambridgeshire,CB22 3HJ,Tel: 01223712050,No ratings yet Rate it yourself - /Services/careproviders/LeaveReview/DefaultView.aspx?id=1-329090225,0,0,,
Sonia Woodward Ltd,1-10758855657,SCL,12 St. Neots Road,Abbotsley,,St. Neots,,PE19 6UU,,No ratings yet Rate it yourself - /Services/careproviders/LeaveReview/DefaultView.aspx?id=1-10758855657,0,0,,
Park House Nursing Care Centre,1-731483592,SCL,Mill Lane,,,Sandy,Bedfordshire,SG19 1NL,Tel: 01767692186,No ratings yet Rate it yourself - /Services/careproviders/LeaveReview/DefaultView.aspx?id=1-731483592,0,0,,
St Catherine's Nursing Home,1-115044576,SCL,Spring Road,,,Letchworth Garden City,Hertfordshire,SG6 3PR,Tel: 01462 678888,No ratings yet Rate it yourself - /Services/careproviders/LeaveReview/DefaultView.aspx?id=1-115044576,0,0,,
Churchfield Avenue,1-14813996585,SCL,21-23 Churchfield Avenue,Sawston,,Cambridge,,CB22 3LA,Tel: 01223835733,No ratings yet Rate it yourself - /Services/careproviders/LeaveReview/DefaultView.aspx?id=1-14813996585,0,0,,
Sheridan House,1-121852509,SCL,8 Bedford Road,,,Sandy,Bedfordshire,SG19 1EL,Tel: 01767691015,No ratings yet Rate it yourself - /Services/careproviders/LeaveReview/DefaultView.aspx?id=1-121852509,0,0,,
Allison House Residential Home,1-1547491839,SCL,Swan Lane,,,Sandy,Bedfordshire,SG19 1NE,Tel: 03003008591,No ratings yet Rate it yourself - /Services/careproviders/LeaveReview/DefaultView.aspx?id=1-1547491839,0,0,,
Cambridge Care Services,1-12629225708,SCL,15 Deal Grove,Sawston,,Cambridge,,CB22 3DR,Tel: 07917611425,No ratings yet Rate it yourself - /Services/careproviders/LeaveReview/DefaultView.aspx?id=1-12629225708,0,0,,
HF Trust - Clifton View,1-659695293,SCL,72A Broad Street,Clifton,,Shefford,Bedfordshire,SG17 5RP,,No ratings yet Rate it yourself - /Services/careproviders/LeaveReview/DefaultView.aspx?id=1-659695293,0,0,,
HF Trust - Bedfordshire & Cambridgeshire DCA,1-773370856,SCL,72a Broad Street,Clifton,,Shefford,Bedfordshire,SG17 5RP,Tel: 01462817235,No ratings yet Rate it yourself - /Services/careproviders/LeaveReview/DefaultView.aspx?id=1-773370856,0,0,,
Guysfield Residential Home,1-128579475,SCL,Willian Road,Willian,,Letchworth Garden City,Hertfordshire,SG6 2AB,Tel: 080 8223 5509,No ratings yet Rate it yourself - /Services/careproviders/LeaveReview/DefaultView.aspx?id=1-128579475,0,0,,
Active Support Clifton Ltd,1-12082875382,SCL,Cedar Court,"Church Street, Clifton",,Shefford,,SG17 5ET,,No ratings yet Rate it yourself - /Services/careproviders/LeaveReview/DefaultView.aspx?id=1-12082875382,0,0,,
Avenues Healthcare Ltd,1-12363025954,SCL,31 Finbracks,,,Stevenage,,SG1 6HB,Tel: 07555775206,No ratings yet Rate it yourself - /Services/careproviders/LeaveReview/DefaultView.aspx?id=1-12363025954,0,0,,
Mobelle Home Care Limited,1-2412223552,SCL,23 Tempsford Road,,,Sandy,Bedfordshire,SG19 2AF,Tel: 07539376753,No ratings yet Rate it yourself - /Services/careproviders/LeaveReview/DefaultView.aspx?id=1-2412223552,0,0,,
Winston House,1-3289009999,SCL,19 Brooklands Avenue,,,Cambridge,Cambridgeshire,CB2 8BG,Tel: 01223356795,No ratings yet Rate it yourself - /Services/careproviders/LeaveReview/DefaultView.aspx?id=1-3289009999,0,0,,
Reed Specialist Recruitment Ltd - Reed Community Care - Cambridge,1-9517853333,SCL,7-8 Clifton Court,,,Cambridge,,CB1 7BN,Tel: 01223316554,1 rating Rate it yourself - /Services/careproviders/LeaveReview/DefaultView.aspx?id=1-9517853333,,,,
St Georges Court Care Home,1-129663748,SCL,Russell Street,,,Cambridge,Cambridgeshire,CB2 1HT,Tel: 01223712135,1 rating Rate it yourself - /Services/careproviders/LeaveReview/DefaultView.aspx?id=1-129663748,,,,
Cambridgeshire County Council - 40/44 Russell Street Cambridge,1-131631228,SCL,40-44 Russell Street,,,Cambridge,Cambridgeshire,CB2 1HT,Tel: 01223712261,No ratings yet Rate it yourself - /Services/careproviders/LeaveReview/DefaultView.aspx?id=1-131631228,0,0,,
Helping Hands Cambridge,1-4632718410,SCL,124 Wulfstan Way,,,Cambridge,Cambridgeshire,CB1 8QJ,Tel: 01223800201,No ratings yet Rate it yourself - /Services/careproviders/LeaveReview/DefaultView.aspx?id=1-4632718410,0,0,,
Halcyon Days,1-3616698021,SCL,The Old Rectory,Church Lane,,Hitchin,Hertfordshire,SG4 7LU,Tel: 01438 315588,No ratings yet Rate it yourself - /Services/careproviders/LeaveReview/DefaultView.aspx?id=1-3616698021,0,0,,
HF Trust - 117 a & b Hitchin Road,1-120701911,SCL,117 A & B Hitchin Road,,,Shefford,Bedfordshire,SG17 5JD,Tel: 01462819199,No ratings yet Rate it yourself - /Services/careproviders/LeaveReview/DefaultView.aspx?id=1-120701911,0,0,,
Domcare24 Ltd,1-14716040826,SCL,"Suite 7, 34-35  Wilbury Way,",Intech House,,Hitchin,,SG4 0TP,,No ratings yet Rate it yourself - /Services/careproviders/LeaveReview/DefaultView.aspx?id=1-14716040826,0,0,,
Laniwyn Care Services Ltd (Homecare),1-4389856886,SCL,54 Wilbury Way,,,Hitchin,Hertfordshire,SG4 0TP,Tel: 074 9626 5471,No ratings yet Rate it yourself - /Services/careproviders/LeaveReview/DefaultView.aspx?id=1-4389856886,0,0,,
Care 4 You Direct Limited,1-11092209660,SCL,"Wicked House, Office 2",56 Wilbury Way,,Hitchin,,SG4 0TP,Tel: 01462539497,No ratings yet Rate it yourself - /Services/careproviders/LeaveReview/DefaultView.aspx?id=1-11092209660,0,0,,