Organisation Name,NACS Code,Organisation Type,Address1,Address2,Address3,Address4,Address5,PostCode,Telephone Number,NHS.UK users rating,Value  (NHS.UK users rating),Banding Classification  (NHS.UK users rating),Car parking (Is there car parking at this organisation?),Disabled access (Disabled access)
Helping Hands Gloucester,1-2551968047,SCL,"First Floor, Unit 2, Ambrose House","Meteor Court, Barnett Way",,"Barnwood, Gloucester",Gloucestershire,GL4 3GG,Tel: 01452226024,No ratings yet Rate it yourself - /Services/careproviders/LeaveReview/DefaultView.aspx?id=1-2551968047,0,0,,
Your Lifestyle Nationwide Limited,1-2916137509,SCL,"Suite 250, Corinium House","Barnwood Point Business Park, Corinium Avenue",,Gloucester,,GL4 3HX,Tel: 01452729757,No ratings yet Rate it yourself - /Services/careproviders/LeaveReview/DefaultView.aspx?id=1-2916137509,0,0,,
Coldbrock Healthcare,1-6745369595,SCL,"Corinium House, BIZSPACE","Barnwood Point, Corinium Avenue",,Gloucester,,GL4 3HX,Tel: 07387077266,1 rating Rate it yourself - /Services/careproviders/LeaveReview/DefaultView.aspx?id=1-6745369595,,,,
Aspirations Southwest Adults,1-13778866709,SCL,365 Corinium House,"Barnwood Point, Corinium Avenue",,Gloucester,,GL4 3HX,Tel: 01452835970,No ratings yet Rate it yourself - /Services/careproviders/LeaveReview/DefaultView.aspx?id=1-13778866709,0,0,,
Sky Vigil Care Ltd Gloucester,1-13251401815,SCL,"Unit 129, Corinium House","Barnwood Point, Corinium Avenue",,Gloucester,,GL4 3HX,Tel: 07775690691,No ratings yet Rate it yourself - /Services/careproviders/LeaveReview/DefaultView.aspx?id=1-13251401815,0,0,,
Global Caring Gloucester,1-12076720079,SCL,Global Caring Group Ltd Room 115,"Corinium House, Corinium Avenue",,Gloucester,,GL4 3HX,Tel: 01452345820,No ratings yet Rate it yourself - /Services/careproviders/LeaveReview/DefaultView.aspx?id=1-12076720079,0,0,,
Gloucester Homecare Services Ltd,1-1751414999,SCL,139 Corinium House,Barnwood Point,,Gloucester,,GL4 3HX,Tel: 01452549495,1 rating Rate it yourself - /Services/careproviders/LeaveReview/DefaultView.aspx?id=1-1751414999,,,,
Home Instead - Gloucester and The Forest of Dean,1-9194216710,SCL,Corinium House,"Barnwood Point, Corinium Avenue",,Gloucester,,GL4 3HX,Tel: 01452341975,No ratings yet Rate it yourself - /Services/careproviders/LeaveReview/DefaultView.aspx?id=1-9194216710,0,0,,
Rehoboth Health and Home Care Limited,1-9224642251,SCL,127 Barnwood House,"Corinium Avenue, Barnwood",,Gloucester,,GL4 3HX,Tel: 07427333614,No ratings yet Rate it yourself - /Services/careproviders/LeaveReview/DefaultView.aspx?id=1-9224642251,0,0,,
Nash Alliance Ltd,1-5227938280,SCL,"Office 249, Corinium House","Barnwood Point Business Park, Corinium Avenue",,Gloucester,,GL4 3HX,Tel: 01452346576,No ratings yet Rate it yourself - /Services/careproviders/LeaveReview/DefaultView.aspx?id=1-5227938280,0,0,,
Woodstock Nursing Home,1-1555434275,SCL,35 North Upton Lane,Barnwood,,Gloucester,Gloucestershire,GL4 3TD,Tel: 01452616291,No ratings yet Rate it yourself - /Services/careproviders/LeaveReview/DefaultView.aspx?id=1-1555434275,0,0,,
Jendot,1-132674750,SCL,3 Little Field,Abbeymead,,Gloucester,Gloucestershire,GL4 4QS,Tel: 01452535963,No ratings yet Rate it yourself - /Services/careproviders/LeaveReview/DefaultView.aspx?id=1-132674750,0,0,,
Machlo,1-132686657,SCL,17 Windmill Field,Abbeymead,,Gloucester,Gloucestershire,GL4 4RQ,Tel: 01452372403,No ratings yet Rate it yourself - /Services/careproviders/LeaveReview/DefaultView.aspx?id=1-132686657,0,0,,
The Red House,1-2916137583,SCL,25 Barnwood Road,,,Gloucester,Gloucestershire,GL2 0SD,Tel: 01452386896,No ratings yet Rate it yourself - /Services/careproviders/LeaveReview/DefaultView.aspx?id=1-2916137583,0,0,,
Charnwood House Nursing Home,1-11975941355,SCL,49 Barnwood Road,,,Gloucester,Gloucestershire,GL2 0SD,Tel: 01452523478,No ratings yet Rate it yourself - /Services/careproviders/LeaveReview/DefaultView.aspx?id=1-11975941355,0,0,,
Avalon Residential Home,1-2026429788,SCL,17 Barnwood Road,,,Gloucester,,GL2 0RZ,Tel: 01452417400,No ratings yet Rate it yourself - /Services/careproviders/LeaveReview/DefaultView.aspx?id=1-2026429788,0,0,,
Hannacott,1-17595435858,SCL,Abbeymead Avenue,Abbeymead,,Gloucester,Gloucestershire,GL4 5GR,Tel: 03333443095,No ratings yet Rate it yourself - /Services/careproviders/LeaveReview/DefaultView.aspx?id=1-17595435858,0,0,,
Abbeymead Lodge,1-17593433290,SCL,Abbeymead Avenue,Abbeymead,,Gloucester,Gloucestershire,GL4 5GR,Tel: 01452617566,No ratings yet Rate it yourself - /Services/careproviders/LeaveReview/DefaultView.aspx?id=1-17593433290,0,0,,
Horton House Residential Care Home,1-124209037,SCL,1 Horton Road,,,Gloucester,Gloucestershire,GL1 3PX,Tel: 01452524615,No ratings yet Rate it yourself - /Services/careproviders/LeaveReview/DefaultView.aspx?id=1-124209037,0,0,,
The Cedars,1-132363977,SCL,144 London Road,,,Gloucester,Gloucestershire,GL2 0RS,Tel: 01452 310727,No ratings yet Rate it yourself - /Services/careproviders/LeaveReview/DefaultView.aspx?id=1-132363977,0,0,,
Eastern Lodge,1-13937319933,SCL,104 Eastern Avenue,,,Gloucester,Gloucestershire,GL4 4LW,Tel: 01452505735,No ratings yet Rate it yourself - /Services/careproviders/LeaveReview/DefaultView.aspx?id=1-13937319933,0,0,,
Chapel House Care Centre,1-1334566074,SCL,Horton Road,,,Gloucester,Gloucestershire,GL1 3LE,Tel: 01452500005,No ratings yet Rate it yourself - /Services/careproviders/LeaveReview/DefaultView.aspx?id=1-1334566074,0,0,,
Guild House Residential Home,1-118262440,SCL,2A Denmark Road,,,Gloucester,Gloucestershire,GL1 3HW,Tel: 01452525098,No ratings yet Rate it yourself - /Services/careproviders/LeaveReview/DefaultView.aspx?id=1-118262440,0,0,,
Wotton Rise Nursing Home Limited,1-126920694,SCL,140 London Road,,,Gloucester,Gloucestershire,GL1 3PL,Tel: 01452303073,No ratings yet Rate it yourself - /Services/careproviders/LeaveReview/DefaultView.aspx?id=1-126920694,0,0,,
Magdalen House Residential Home,1-118280207,SCL,London Road,,,Gloucester,Gloucestershire,GL1 3PH,Tel: 01452386331,No ratings yet Rate it yourself - /Services/careproviders/LeaveReview/DefaultView.aspx?id=1-118280207,0,0,,
Great Western Court,1-115336861,SCL,33a Millbrook Street,,,Gloucester,Gloucestershire,GL1 4BG,Tel: 01452423495,No ratings yet Rate it yourself - /Services/careproviders/LeaveReview/DefaultView.aspx?id=1-115336861,0,0,,
Saintbridge House Nursing and Residential Home,1-470456880,SCL,189 Painswick Road,Abbeydale,,Gloucester,Gloucestershire,GL4 4QQ,Tel: 01452300307,No ratings yet Rate it yourself - /Services/careproviders/LeaveReview/DefaultView.aspx?id=1-470456880,0,0,,
Alexandra House Care Home,1-132363569,SCL,2 Alexandra Road,,,Gloucester,Gloucestershire,GL1 3DR,Tel: 01452 418575,No ratings yet Rate it yourself - /Services/careproviders/LeaveReview/DefaultView.aspx?id=1-132363569,0,0,,
Trevone House,1-10529920811,SCL,22 Denmark Road,,,Gloucester,Gloucestershire,GL1 3HZ,Tel: 01452937220,No ratings yet Rate it yourself - /Services/careproviders/LeaveReview/DefaultView.aspx?id=1-10529920811,0,0,,
First Thought Care Services,1-14807426692,SCL,164 Hucclecote Road,,,Gloucester,,GL3 3SH,Tel: 01242472126,No ratings yet Rate it yourself - /Services/careproviders/LeaveReview/DefaultView.aspx?id=1-14807426692,0,0,,
Chosen Court,1-134382121,SCL,Hucclecote Road,,,Gloucester,Gloucestershire,GL3 3TX,Tel: 01452616888,No ratings yet Rate it yourself - /Services/careproviders/LeaveReview/DefaultView.aspx?id=1-134382121,0,0,,
46 London Road,1-129459157,SCL,Gloucester,,,Gloucester,Gloucestershire,GL1 3NZ,,No ratings yet Rate it yourself - /Services/careproviders/LeaveReview/DefaultView.aspx?id=1-129459157,0,0,,
Fern Croft,1-111001496,SCL,14 Heathville Road,,,Gloucester,Gloucestershire,GL1 3DS,Tel: 01452505803,No ratings yet Rate it yourself - /Services/careproviders/LeaveReview/DefaultView.aspx?id=1-111001496,0,0,,
Care at Home (High Street),1-8461470476,SCL,113 High Street,Tredworth,,Gloucester,,GL1 4SY,Tel: 01452300025,No ratings yet Rate it yourself - /Services/careproviders/LeaveReview/DefaultView.aspx?id=1-8461470476,0,0,,
Lean On Me Care Services Limited,1-12771027531,SCL,40 London Road,,,Gloucester,,GL1 3NU,Tel: 07958649933,No ratings yet Rate it yourself - /Services/careproviders/LeaveReview/DefaultView.aspx?id=1-12771027531,0,0,,
Gloscare,1-128004785,SCL,23 Carmarthen Street,,,Gloucester,Gloucestershire,GL1 4SX,Tel: 01452522335,No ratings yet Rate it yourself - /Services/careproviders/LeaveReview/DefaultView.aspx?id=1-128004785,0,0,,
Direct Source Healthcare Ltd,1-4016132009,SCL,"Suite 4B, 121-131 Eastgate House",Eastgate Street,,Gloucester,,GL1 1PX,Tel: 07940252861,2 ratings Rate it yourself - /Services/careproviders/LeaveReview/DefaultView.aspx?id=1-4016132009,,,,
Newcross Healthcare Solutions Limited - West,1-5207958985,SCL,"First Floor, Eastgate House",121-131 Eastgate Street,,Gloucester,,GL1 1PX,Tel: 03300545592,No ratings yet Rate it yourself - /Services/careproviders/LeaveReview/DefaultView.aspx?id=1-5207958985,0,0,,
Betha care limited,1-14428767875,SCL,Number 1 Business Centre,1 Alvin Street,,Gloucester,,GL1 3EJ,Tel: 07359425394,No ratings yet Rate it yourself - /Services/careproviders/LeaveReview/DefaultView.aspx?id=1-14428767875,0,0,,
Mega Resources Nursing & Care - Gloucestershire,1-15178529338,SCL,1 Alvin Street,,,Gloucester,,GL1 3EJ,,No ratings yet Rate it yourself - /Services/careproviders/LeaveReview/DefaultView.aspx?id=1-15178529338,0,0,,
Raystra Healthcare,1-7332642791,SCL,1 Alvin Street,,,Gloucester,,GL1 3EJ,Tel: 01452238262,No ratings yet Rate it yourself - /Services/careproviders/LeaveReview/DefaultView.aspx?id=1-7332642791,0,0,,
Profound Housing and Support Ltd,1-15875245386,SCL,21 Ferndale Close,,,Gloucester,,GL2 9RT,,No ratings yet Rate it yourself - /Services/careproviders/LeaveReview/DefaultView.aspx?id=1-15875245386,0,0,,
Carmel Domiciliary Care Limited,1-10206005895,SCL,18 Worcester Street,,,Gloucester,,GL1 3AA,Tel: 07960266932,No ratings yet Rate it yourself - /Services/careproviders/LeaveReview/DefaultView.aspx?id=1-10206005895,0,0,,
Chosen Care Supported Living,1-14486427993,SCL,Conway House,31 Worcester Street,,Gloucester,,GL1 3AJ,Tel: 01452520011,No ratings yet Rate it yourself - /Services/careproviders/LeaveReview/DefaultView.aspx?id=1-14486427993,0,0,,
Option Care Ltd,1-5108620840,SCL,Conway House,31 Worcester Street,,Gloucester,,GL1 3AJ,Tel: 07789475993,No ratings yet Rate it yourself - /Services/careproviders/LeaveReview/DefaultView.aspx?id=1-5108620840,0,0,,
Momo & Tarek Care Gloucester,1-15488340139,SCL,Conway House,31 Worcester Street,,Gloucester,,GL1 3AJ,Tel: 07309098297,No ratings yet Rate it yourself - /Services/careproviders/LeaveReview/DefaultView.aspx?id=1-15488340139,0,0,,
Merry Den,1-125905909,SCL,Conway House,31 Worcester Street,,Gloucester,,GL1 3AJ,Tel: 07534142118,No ratings yet Rate it yourself - /Services/careproviders/LeaveReview/DefaultView.aspx?id=1-125905909,0,0,,
Turn Up Care Limited,1-14864721251,SCL,31 Worcester Street,,,Gloucester,,GL1 3AJ,Tel: 01452934994,No ratings yet Rate it yourself - /Services/careproviders/LeaveReview/DefaultView.aspx?id=1-14864721251,0,0,,
New Hope Care Gloucester,1-17594288547,SCL,31,Worcester Street,,Gloucester,,GL1 3AJ,Tel: 01452238419,No ratings yet Rate it yourself - /Services/careproviders/LeaveReview/DefaultView.aspx?id=1-17594288547,0,0,,
Conway House,1-9334318064,SCL,31 Worcester Street,,,Gloucester,,GL1 3AJ,,No ratings yet Rate it yourself - /Services/careproviders/LeaveReview/DefaultView.aspx?id=1-9334318064,0,0,,
State Care Solutions - Main Office,1-10490072597,SCL,31 Worcester Street,Conway House,,Gloucester,,GL1 3AJ,Tel: 01452699670,No ratings yet Rate it yourself - /Services/careproviders/LeaveReview/DefaultView.aspx?id=1-10490072597,0,0,,
Prosperity Care and Wellbeing,1-10535708147,SCL,"Conway House, 31-33 Worcester Street",,,Gloucester,,GL1 3AJ,Tel: 01242906569,1 rating Rate it yourself - /Services/careproviders/LeaveReview/DefaultView.aspx?id=1-10535708147,,,,
Foundation House,1-1543364490,SCL,"Foundation House, National Star College",14A St Michaels Square,,Gloucester,Gloucestershire,GL1 1HX,Tel: 01242527631,No ratings yet Rate it yourself - /Services/careproviders/LeaveReview/DefaultView.aspx?id=1-1543364490,0,0,,
St Paul's Residential Home,1-124116713,SCL,127 Stroud Road,,,Gloucester,Gloucestershire,GL1 5JL,Tel: 01452505485,No ratings yet Rate it yourself - /Services/careproviders/LeaveReview/DefaultView.aspx?id=1-124116713,0,0,,
Springfield House,1-2847248469,SCL,255D Stroud Road,,,Gloucester,Gloucestershire,GL1 5JZ,Tel: 01452312383,No ratings yet Rate it yourself - /Services/careproviders/LeaveReview/DefaultView.aspx?id=1-2847248469,0,0,,
My Homecare Gloucester,1-16522936277,SCL,39-41,St. Catherine Street,,Gloucester,,GL1 2BS,Tel: 01452757564,No ratings yet Rate it yourself - /Services/careproviders/LeaveReview/DefaultView.aspx?id=1-16522936277,0,0,,
Broomfield Care Home Care Services,1-548043739,SCL,Suite 1 The Business Centre,Innsworth Technology Park,,Gloucester,Gloucestershire,GL3 1DL,Tel: 01452 730888,No ratings yet Rate it yourself - /Services/careproviders/LeaveReview/DefaultView.aspx?id=1-548043739,0,0,,
Godwill Care,1-7065161771,SCL,36 Brunswick Road,,,Gloucester,,GL1 1JJ,Tel: 07894558639,No ratings yet Rate it yourself - /Services/careproviders/LeaveReview/DefaultView.aspx?id=1-7065161771,0,0,,
Ribston House,1-111001480,SCL,210 Stroud Road,,,Gloucester,Gloucestershire,GL1 5LA,Tel: 01452310916,No ratings yet Rate it yourself - /Services/careproviders/LeaveReview/DefaultView.aspx?id=1-111001480,0,0,,
Within Reach,1-8939245389,SCL,28 Westgate Street,,,Gloucester,,GL1 2NG,Tel: 01242801201,1 rating Rate it yourself - /Services/careproviders/LeaveReview/DefaultView.aspx?id=1-8939245389,,,,
Kings Den,1-10644909116,SCL,101 Reservoir Road,,,Gloucester,,GL4 6SZ,Tel: 01452554120,No ratings yet Rate it yourself - /Services/careproviders/LeaveReview/DefaultView.aspx?id=1-10644909116,0,0,,
Arriva Care Services Limited,1-1887389296,SCL,Gloucester House,29 Brunswick Square,,Gloucester,Gloucestershire,GL1 1UN,Tel: 01452501552,1 rating Rate it yourself - /Services/careproviders/LeaveReview/DefaultView.aspx?id=1-1887389296,,,,
Transforming Minds - Main Office,1-11389518355,SCL,Southgate House,Southgate,,Gloucester,,GL1 1UD,,No ratings yet Rate it yourself - /Services/careproviders/LeaveReview/DefaultView.aspx?id=1-11389518355,0,0,,
Multilink Management Care Ltd,1-6591364470,SCL,Southgate House,Southgate Street,,Gloucester,,GL1 1DL,Tel: 01452930291,No ratings yet Rate it yourself - /Services/careproviders/LeaveReview/DefaultView.aspx?id=1-6591364470,0,0,,
Bramble House,1-121887670,SCL,Bramble House,96a-98 Stroud Road,,Gloucester,Gloucestershire,GL1 5AJ,Tel: 01452521018,No ratings yet Rate it yourself - /Services/careproviders/LeaveReview/DefaultView.aspx?id=1-121887670,0,0,,
My Supported Life LLP,1-18024855502,SCL,Bearland Lodge,47 Longsmith Street,,Gloucester,,GL1 2HT,Tel: 07306857054,No ratings yet Rate it yourself - /Services/careproviders/LeaveReview/DefaultView.aspx?id=1-18024855502,0,0,,
BASELINE HEALTHCARE AND SUPPORT SERVICES LIMITED,1-18443211430,SCL,45-47,Longsmith Street,,Gloucester,,GL1 2HT,Tel: 07557371470,No ratings yet Rate it yourself - /Services/careproviders/LeaveReview/DefaultView.aspx?id=1-18443211430,0,0,,
T2Z Care Services,1-7722962717,SCL,Bearland Lodge,45-47 Longsmith Street,,Gloucester,,GL1 2HT,Tel: 07498987626,No ratings yet Rate it yourself - /Services/careproviders/LeaveReview/DefaultView.aspx?id=1-7722962717,0,0,,
P & N Healthcare Services Ltd - Gloucester,1-15035635890,SCL,Southgate House,Southgate Street,,Gloucester,Gloucestershire,GL1 1UB,Tel: 07507793341,No ratings yet Rate it yourself - /Services/careproviders/LeaveReview/DefaultView.aspx?id=1-15035635890,0,0,,
Essential Care Solutions Ltd,1-12865113024,SCL,"Office 16, Southgate House",Southgate Street,,Gloucester,,GL1 1UB,Tel: 07802314175,No ratings yet Rate it yourself - /Services/careproviders/LeaveReview/DefaultView.aspx?id=1-12865113024,0,0,,
Karva Care Services Limited,1-10358952663,SCL,Figflex Offices 31,First Floor Southgate House,,Gloucester,,GL1 1UB,Tel: 07963516914,No ratings yet Rate it yourself - /Services/careproviders/LeaveReview/DefaultView.aspx?id=1-10358952663,0,0,,
Comfort Call - Cheltenham,1-3106617526,SCL,"Office No. G11, GF North Warehouse",Gloucester Docks,,Gloucester,,GL1 2EP,Tel: 01242574594,No ratings yet Rate it yourself - /Services/careproviders/LeaveReview/DefaultView.aspx?id=1-3106617526,0,0,,
The Dean Neurological Centre,1-13354544438,SCL,Tewkesbury Road,Longford,,Gloucester,Gloucestershire,GL2 9EE,Tel: 01452420200,No ratings yet Rate it yourself - /Services/careproviders/LeaveReview/DefaultView.aspx?id=1-13354544438,0,0,,
Park View Gloucester,1-2820810942,SCL,Trier Way,,,Gloucester,Gloucestershire,GL1 1AN,Tel: 01452 671499,No ratings yet Rate it yourself - /Services/careproviders/LeaveReview/DefaultView.aspx?id=1-2820810942,0,0,,
Redlands Acre,1-122110065,SCL,35 Tewkesbury Road,Longford,,Gloucester,Gloucestershire,GL2 9BD,Tel: 01452507248,No ratings yet Rate it yourself - /Services/careproviders/LeaveReview/DefaultView.aspx?id=1-122110065,0,0,,
Cathedral View,1-115336782,SCL,Archdeacon Street,,,Gloucester,Gloucestershire,GL1 2QX,Tel: 01452303248,No ratings yet Rate it yourself - /Services/careproviders/LeaveReview/DefaultView.aspx?id=1-115336782,0,0,,
Naswell Care LTD,1-912115696,SCL,"Unit 2, Office 8","Morelands Trading Estate, Bristol Road",,Gloucester,Gloucestershire,GL1 5RZ,Tel: 01452722791,1 rating Rate it yourself - /Services/careproviders/LeaveReview/DefaultView.aspx?id=1-912115696,,,,
Care-Nursing Alliance Recruitment,1-395582550,SCL,Suite C,"Sudbrooke House, High Orchard Street",,Gloucester,Gloucestershire,GL2 5QY,Tel: 01452508299,No ratings yet Rate it yourself - /Services/careproviders/LeaveReview/DefaultView.aspx?id=1-395582550,0,0,,
Gloucestershire County Council Shared Lives,1-115336964,SCL,"Quayside House, Quayside Wing",Quay Street,,Gloucester,Gloucestershire,GL1 2JU,,No ratings yet Rate it yourself - /Services/careproviders/LeaveReview/DefaultView.aspx?id=1-115336964,0,0,,
Gloucestershire,1-15125973943,SCL,"Suite 12, North Warehouse",Gloucester Docks,,Gloucester,,GL1 2FB,Tel: 07935473423,No ratings yet Rate it yourself - /Services/careproviders/LeaveReview/DefaultView.aspx?id=1-15125973943,0,0,,
New Leaf Supported Living Limited,1-10199602829,SCL,"112 First Floor, North Warehouse",The Docks,,Gloucester,,GL1 2FB,Tel: 07947184270,No ratings yet Rate it yourself - /Services/careproviders/LeaveReview/DefaultView.aspx?id=1-10199602829,0,0,,
Step Up -Domiciliary Care,1-13834091122,SCL,North Warehouse,The Docks,,Gloucester,Gloucestershire,GL1 2FB,Tel: 01452835670,No ratings yet Rate it yourself - /Services/careproviders/LeaveReview/DefaultView.aspx?id=1-13834091122,0,0,,
Parton House,1-122110093,SCL,Parton Road,Churchdown,,Gloucester,Gloucestershire,GL3 2JE,Tel: 01452856779,No ratings yet Rate it yourself - /Services/careproviders/LeaveReview/DefaultView.aspx?id=1-122110093,0,0,,
Cavendish Care Home,1-135670824,SCL,301 Stroud Road,,,Gloucester,Gloucestershire,GL1 5LF,Tel: 01452521896,No ratings yet Rate it yourself - /Services/careproviders/LeaveReview/DefaultView.aspx?id=1-135670824,0,0,,
Brunswick House Nursing Home,1-118898566,SCL,119 Reservoir Road,,,Gloucester,Gloucestershire,GL4 6SX,Tel: 01452523903,No ratings yet Rate it yourself - /Services/careproviders/LeaveReview/DefaultView.aspx?id=1-118898566,0,0,,
Westbourne Care Home,1-149007745,SCL,190 Reservoir Road,,,Gloucester,Gloucestershire,GL4 6SB,Tel: 01452 506106,No ratings yet Rate it yourself - /Services/careproviders/LeaveReview/DefaultView.aspx?id=1-149007745,0,0,,
Edward House,1-124541840,SCL,Matson Lane,,,Gloucester,Gloucestershire,GL4 6ED,Tel: 01452302462,No ratings yet Rate it yourself - /Services/careproviders/LeaveReview/DefaultView.aspx?id=1-124541840,0,0,,
Matson House,1-124541825,SCL,Matson Lane,,,Gloucester,Gloucestershire,GL4 6ED,Tel: 01452302458,No ratings yet Rate it yourself - /Services/careproviders/LeaveReview/DefaultView.aspx?id=1-124541825,0,0,,
Jasper Lodge,1-124541808,SCL,Matson Lane,,,Gloucester,Gloucestershire,GL4 6ED,Tel: 01452302492,No ratings yet Rate it yourself - /Services/careproviders/LeaveReview/DefaultView.aspx?id=1-124541808,0,0,,
Selborne Care DCA,1-416358021,SCL,Selwyn Care,Matson Lane,,Gloucester,,GL4 6ED,Tel: 01905779548,No ratings yet Rate it yourself - /Services/careproviders/LeaveReview/DefaultView.aspx?id=1-416358021,0,0,,
Stroud Lodge,1-2847234051,SCL,319 Stroud Road,,,Gloucester,Gloucestershire,GL1 5LG,Tel: 01452312216,No ratings yet Rate it yourself - /Services/careproviders/LeaveReview/DefaultView.aspx?id=1-2847234051,0,0,,
St Oswald's Retirement Village,1-218209585,SCL,Gavel Way,,,Gloucester,Gloucestershire,GL1 2UF,Tel: 01452875000,No ratings yet Rate it yourself - /Services/careproviders/LeaveReview/DefaultView.aspx?id=1-218209585,0,0,,
The Pembury,1-123066358,SCL,9 Pembury Road,,,Gloucester,Gloucestershire,GL4 6UE,Tel: 01452521856,No ratings yet Rate it yourself - /Services/careproviders/LeaveReview/DefaultView.aspx?id=1-123066358,0,0,,
Bridgeout Healthcare Services Ltd,1-17707966048,SCL,"Office 6, Parish Council Offices, Community Centre","Court Road, Brockworth",,Gloucester,,GL3 4ET,Tel: 07557785103,No ratings yet Rate it yourself - /Services/careproviders/LeaveReview/DefaultView.aspx?id=1-17707966048,0,0,,
Dean Healthcare South West Ltd - Gloucester,1-2858159354,SCL,Westgate House,The Island,,Gloucester,Gloucestershire,GL1 2RU,Tel: 01452507452,No ratings yet Rate it yourself - /Services/careproviders/LeaveReview/DefaultView.aspx?id=1-2858159354,0,0,,
"Mutual Benefit Care Limited t/a Bluebird Care - Suite 4, Westgate House",1-126920923,SCL,"Suite 4, Westgate House",Westgate Business Centre,,Gloucester,Gloucestershire,GL1 2RU,Tel: 01452414952,1 rating Rate it yourself - /Services/careproviders/LeaveReview/DefaultView.aspx?id=1-126920923,,,,
Royale Healthcare Limited,1-16495221524,SCL,Suite 11,"Westgate House, Westgate Retail Park",,Gloucester,,GL1 2RU,Tel: 01452471006,No ratings yet Rate it yourself - /Services/careproviders/LeaveReview/DefaultView.aspx?id=1-16495221524,0,0,,
OSJCT Millbrook Lodge,1-122144900,SCL,Moorfield Road,Brockworth,,Gloucester,Gloucestershire,GL3 4EX,Tel: 01452863783,No ratings yet Rate it yourself - /Services/careproviders/LeaveReview/DefaultView.aspx?id=1-122144900,0,0,,
YourLife (Gloucester),1-8844431727,SCL,Llanthony Place,St Ann Way,,Gloucester,,GL2 5JQ,Tel: 01452422062,No ratings yet Rate it yourself - /Services/careproviders/LeaveReview/DefaultView.aspx?id=1-8844431727,0,0,,
Care at Home Gloucester,1-9741576810,SCL,Mill Place 1,"Unit 1, 90 Bristol Road",,Gloucester,,GL1 5SQ,Tel: 01452300025,No ratings yet Rate it yourself - /Services/careproviders/LeaveReview/DefaultView.aspx?id=1-9741576810,0,0,,
Brockworth House Care Centre,1-117976985,SCL,Mill Lane,Brockworth,,Gloucester,Gloucestershire,GL3 4QG,Tel: 01452864066,No ratings yet Rate it yourself - /Services/careproviders/LeaveReview/DefaultView.aspx?id=1-117976985,0,0,,
Shy Lowen Care Limited,1-1031162250,SCL,163 Bristol Road,,,Gloucester,Gloucestershire,GL1 5TG,Tel: 01452539200,No ratings yet Rate it yourself - /Services/careproviders/LeaveReview/DefaultView.aspx?id=1-1031162250,0,0,,
The Knoll,1-154385984,SCL,335 Stroud Road,Tuffley,,Gloucester,Gloucestershire,GL4 0BD,Tel: 01452526146,No ratings yet Rate it yourself - /Services/careproviders/LeaveReview/DefaultView.aspx?id=1-154385984,0,0,,
Chestnut Care,1-495560778,SCL,20 Podsmead Road,,,Gloucester,Gloucestershire,GL1 5PA,,No ratings yet Rate it yourself - /Services/careproviders/LeaveReview/DefaultView.aspx?id=1-495560778,0,0,,