Organisation Name,NACS Code,Organisation Type,Address1,Address2,Address3,Address4,Address5,PostCode,Telephone Number,NHS.UK users rating,Value  (NHS.UK users rating),Banding Classification  (NHS.UK users rating),Car parking (Is there car parking at this organisation?),Disabled access (Disabled access)
Badgeworth Court Care Centre,1-125862274,SCL,Badgeworth,,,Cheltenham,Gloucestershire,GL51 4UL,Tel: 01452715015,2 ratings Rate it yourself - /Services/careproviders/LeaveReview/DefaultView.aspx?id=1-125862274,,,,
Care at Home,1-145085936,SCL,"Room 41, The Studio Block","Cheltenham Film Studios, Arle Court, Hatherley Road",,Cheltenham,Gloucestershire,GL51 6PN,Tel: 01242242061,No ratings yet Rate it yourself - /Services/careproviders/LeaveReview/DefaultView.aspx?id=1-145085936,0,0,,
Richmond Village Cheltenham,1-8379263850,SCL,Care Home,Hatherley Lane,,Cheltenham,,GL51 6PN,Tel: 01242474333,No ratings yet Rate it yourself - /Services/careproviders/LeaveReview/DefaultView.aspx?id=1-8379263850,0,0,,
Richmond Village Cheltenham DCA,1-8416315206,SCL,Hatherley Lane,,,Cheltenham,,GL51 6PN,Tel: 01242474333,No ratings yet Rate it yourself - /Services/careproviders/LeaveReview/DefaultView.aspx?id=1-8416315206,0,0,,
Caremark Cheltenham and Tewkesbury,1-4432315418,SCL,"Office P9 Photographic block, Cheltenham Film Studios","Arle Court, Hatherley Lane",,Cheltenham,,GL51 6PN,Tel: 01242370797,No ratings yet Rate it yourself - /Services/careproviders/LeaveReview/DefaultView.aspx?id=1-4432315418,0,0,,
Benhall Care,1-10736291527,SCL,1st Floor Animation Block,"Cheltenham Film Studios, Hatherley Lane",,Cheltenham,,GL51 6PN,Tel: 07780432505,No ratings yet Rate it yourself - /Services/careproviders/LeaveReview/DefaultView.aspx?id=1-10736291527,0,0,,
Chargrove Lawn,1-122110079,SCL,Shurdington Road,,,Cheltenham,Gloucestershire,GL51 4XA,Tel: 01242862686,No ratings yet Rate it yourself - /Services/careproviders/LeaveReview/DefaultView.aspx?id=1-122110079,0,0,,
Whittington House Nursing Home,1-948485961,SCL,58 Whittington Road,,,Cheltenham,Gloucestershire,GL51 6BL,Tel: 01242259260,No ratings yet Rate it yourself - /Services/careproviders/LeaveReview/DefaultView.aspx?id=1-948485961,0,0,,
Parton House,1-122110093,SCL,Parton Road,Churchdown,,Gloucester,Gloucestershire,GL3 2JE,Tel: 01452856779,No ratings yet Rate it yourself - /Services/careproviders/LeaveReview/DefaultView.aspx?id=1-122110093,0,0,,
Brockworth House Care Centre,1-117976985,SCL,Mill Lane,Brockworth,,Gloucester,Gloucestershire,GL3 4QG,Tel: 01452864066,No ratings yet Rate it yourself - /Services/careproviders/LeaveReview/DefaultView.aspx?id=1-117976985,0,0,,
Bramble Home Care Limited,1-1670761506,SCL,Unit E,"4 Bamfurlong Industrial Park, Staverton",,Cheltenham,,GL51 6SX,Tel: 01684215128,No ratings yet Rate it yourself - /Services/careproviders/LeaveReview/DefaultView.aspx?id=1-1670761506,0,0,,
Bridgeout Healthcare Services Ltd,1-17707966048,SCL,"Office 6, Parish Council Offices, Community Centre","Court Road, Brockworth",,Gloucester,,GL3 4ET,Tel: 07557785103,No ratings yet Rate it yourself - /Services/careproviders/LeaveReview/DefaultView.aspx?id=1-17707966048,0,0,,
OSJCT Millbrook Lodge,1-122144900,SCL,Moorfield Road,Brockworth,,Gloucester,Gloucestershire,GL3 4EX,Tel: 01452863783,No ratings yet Rate it yourself - /Services/careproviders/LeaveReview/DefaultView.aspx?id=1-122144900,0,0,,
Ambleside,1-137768877,SCL,69 Hatherley Road,,,Cheltenham,Gloucestershire,GL51 6EG,Tel: 01242522937,1 rating Rate it yourself - /Services/careproviders/LeaveReview/DefaultView.aspx?id=1-137768877,,,,
The Granleys,1-138901716,SCL,21 Griffiths Avenue,,,Cheltenham,Gloucestershire,GL51 7BE,Tel: 01242521721,No ratings yet Rate it yourself - /Services/careproviders/LeaveReview/DefaultView.aspx?id=1-138901716,0,0,,
The Knole,1-442981675,SCL,23 Griffiths Avenue,,,Cheltenham,Gloucestershire,GL51 7BE,Tel: 01242526978,No ratings yet Rate it yourself - /Services/careproviders/LeaveReview/DefaultView.aspx?id=1-442981675,0,0,,
Monkscroft Care Centre,1-451476070,SCL,Shelley Road,,,Cheltenham,Gloucestershire,GL51 7DP,Tel: 01242321111,No ratings yet Rate it yourself - /Services/careproviders/LeaveReview/DefaultView.aspx?id=1-451476070,0,0,,
Alina Homecare - Cheltenham,1-11719442941,SCL,"Office 16, Lancaster Centre","Meteor Business Park,",,Gloucester,,GL2 9QL,Tel: 01242903713,No ratings yet Rate it yourself - /Services/careproviders/LeaveReview/DefaultView.aspx?id=1-11719442941,0,0,,
Dalkeith,1-840613286,SCL,285 Gloucester Road,,,Cheltenham,Gloucestershire,GL51 7AD,Tel: 01242522209,No ratings yet Rate it yourself - /Services/careproviders/LeaveReview/DefaultView.aspx?id=1-840613286,0,0,,
Beechcroft - Cheltenham,1-2847288176,SCL,295 Gloucester Road,,,Cheltenham,Gloucestershire,GL51 7AD,Tel: 01242244678,No ratings yet Rate it yourself - /Services/careproviders/LeaveReview/DefaultView.aspx?id=1-2847288176,0,0,,
Brighter Home Care,1-6910170776,SCL,Hesters Way Community Resource Centre,Cassin Way,,Cheltenham,,GL51 7SU,,No ratings yet Rate it yourself - /Services/careproviders/LeaveReview/DefaultView.aspx?id=1-6910170776,0,0,,
Chosen Court,1-134382121,SCL,Hucclecote Road,,,Gloucester,Gloucestershire,GL3 3TX,Tel: 01452616888,No ratings yet Rate it yourself - /Services/careproviders/LeaveReview/DefaultView.aspx?id=1-134382121,0,0,,
Royal Court,1-2869231168,SCL,Fiddlers Green Lane,,,Cheltenham,Gloucestershire,GL51 0SF,Tel: 01242221853,No ratings yet Rate it yourself - /Services/careproviders/LeaveReview/DefaultView.aspx?id=1-2869231168,0,0,,
Shaftesbury Place,1-1488212630,SCL,52 Marsland Road,,,Gloucester,,GL51 0JA,Tel: 01242227818,No ratings yet Rate it yourself - /Services/careproviders/LeaveReview/DefaultView.aspx?id=1-1488212630,0,0,,
First Thought Care Services,1-14807426692,SCL,164 Hucclecote Road,,,Gloucester,,GL3 3SH,Tel: 01242472126,No ratings yet Rate it yourself - /Services/careproviders/LeaveReview/DefaultView.aspx?id=1-14807426692,0,0,,
Bredon View,1-122110107,SCL,24-26 Libertus Road,,,Cheltenham,Gloucestershire,GL51 7EL,Tel: 01242525087,No ratings yet Rate it yourself - /Services/careproviders/LeaveReview/DefaultView.aspx?id=1-122110107,0,0,,
CareTech Community Services Limited - 15 Brooklyn Road,1-133435604,SCL,15 Brooklyn Road,,,Cheltenham,Gloucestershire,GL51 8DT,Tel: 01242581112,No ratings yet Rate it yourself - /Services/careproviders/LeaveReview/DefaultView.aspx?id=1-133435604,0,0,,
Queensbridge House,1-121047648,SCL,63 Queens Road,,,Cheltenham,Gloucestershire,GL50 2NF,,No ratings yet Rate it yourself - /Services/careproviders/LeaveReview/DefaultView.aspx?id=1-121047648,0,0,,
Expeditions Living,1-624705176,SCL,"22 Maxet House, Lansdown Industrial Estate",Gloucester Road,,Cheltenham,Gloucestershire,GL51 8PL,Tel: 01242308510,1 rating Rate it yourself - /Services/careproviders/LeaveReview/DefaultView.aspx?id=1-624705176,,,,
Accolade Support and Care Ltd,1-2931398918,SCL,Maxet House,"Lansdown Industrial Estate, Gloucester Road",,Cheltenham,,GL51 8PL,Tel: 01242374044,No ratings yet Rate it yourself - /Services/careproviders/LeaveReview/DefaultView.aspx?id=1-2931398918,0,0,,
Aim Up,1-745680492,SCL,Well Close House,Lansdown Parade,,Cheltenham,Gloucestershire,GL50 2LH,Tel: 01242515035,No ratings yet Rate it yourself - /Services/careproviders/LeaveReview/DefaultView.aspx?id=1-745680492,0,0,,
The Vicarage,1-115336828,SCL,59 Andover Road,Tivoli,,Cheltenham,Gloucestershire,GL50 2TS,Tel: 01242521918,1 rating Rate it yourself - /Services/careproviders/LeaveReview/DefaultView.aspx?id=1-115336828,,,,
Ravenswood House,1-414375677,SCL,Ravenswood House,Westall green,,Cheltenham,Gloucestershire,GL50 2JA,Tel: 01242 514264,No ratings yet Rate it yourself - /Services/careproviders/LeaveReview/DefaultView.aspx?id=1-414375677,0,0,,
Alexander House Care Home - Cheltenham,1-112309865,SCL,Alexander House,16 Tivoli Road,,Cheltenham,Gloucestershire,GL50 2TG,Tel: 01242513525,No ratings yet Rate it yourself - /Services/careproviders/LeaveReview/DefaultView.aspx?id=1-112309865,0,0,,
Merit Care Ltd,1-5072914995,SCL,"1st Floor, Unit 15","Alstone Trading Estate, Alstone Lane",,Cheltenham,,GL51 8HF,Tel: 01242300380,No ratings yet Rate it yourself - /Services/careproviders/LeaveReview/DefaultView.aspx?id=1-5072914995,0,0,,
Hampton House Care Home,1-108741211,SCL,94 Leckhampton Road,,,Cheltenham,Gloucestershire,GL53 0BN,Tel: 01242 520527,No ratings yet Rate it yourself - /Services/careproviders/LeaveReview/DefaultView.aspx?id=1-108741211,0,0,,
Raynsford Domiciliary Care,1-2594943954,SCL,Head Office,24 Suffolk Square,,Cheltenham,,GL50 2EA,Tel: 01242243483,No ratings yet Rate it yourself - /Services/careproviders/LeaveReview/DefaultView.aspx?id=1-2594943954,0,0,,
St Faith's Nursing Home,1-130490637,SCL,Malvern Road,,,Cheltenham,Gloucestershire,GL50 2NR,Tel: 01242240240,No ratings yet Rate it yourself - /Services/careproviders/LeaveReview/DefaultView.aspx?id=1-130490637,0,0,,
Sandfields,1-1207038123,SCL,St Georges Road,,,Cheltenham,Gloucestershire,GL50 3EL,Tel: 03333210921,No ratings yet Rate it yourself - /Services/careproviders/LeaveReview/DefaultView.aspx?id=1-1207038123,0,0,,
Radis Community Care (Middleton House),1-15499696756,SCL,Pilley Lane,Leckhampton,,Cheltenham,,GL53 9GA,,No ratings yet Rate it yourself - /Services/careproviders/LeaveReview/DefaultView.aspx?id=1-15499696756,0,0,,
Faithfull House,1-130490622,SCL,Suffolk Square,,,Cheltenham,Gloucestershire,GL50 2DT,Tel: 01242514319,1 rating Rate it yourself - /Services/careproviders/LeaveReview/DefaultView.aspx?id=1-130490622,,,,
Lilleybrook Care Home,1-983777097,SCL,Pilley Lane,,,Cheltenham,Gloucestershire,GL53 9ER,Tel: 01242225790,No ratings yet Rate it yourself - /Services/careproviders/LeaveReview/DefaultView.aspx?id=1-983777097,0,0,,
Woodstock Nursing Home,1-1555434275,SCL,35 North Upton Lane,Barnwood,,Gloucester,Gloucestershire,GL4 3TD,Tel: 01452616291,No ratings yet Rate it yourself - /Services/careproviders/LeaveReview/DefaultView.aspx?id=1-1555434275,0,0,,
Your Life (Cheltenham),1-858874500,SCL,Jenner Court,St Georges Road,,Cheltenham,,GL50 3ER,Tel: 01242571704,No ratings yet Rate it yourself - /Services/careproviders/LeaveReview/DefaultView.aspx?id=1-858874500,0,0,,
Helping Hands Gloucester,1-2551968047,SCL,"First Floor, Unit 2, Ambrose House","Meteor Court, Barnett Way",,"Barnwood, Gloucester",Gloucestershire,GL4 3GG,Tel: 01452226024,No ratings yet Rate it yourself - /Services/careproviders/LeaveReview/DefaultView.aspx?id=1-2551968047,0,0,,
Astell,1-130490605,SCL,Overton Park Road,,,Cheltenham,Gloucestershire,GL50 3BT,Tel: 01242529012,No ratings yet Rate it yourself - /Services/careproviders/LeaveReview/DefaultView.aspx?id=1-130490605,0,0,,
Gloucestershire House - Care Home with Nursing Physical Disabilities,1-120087914,SCL,Charlton Lane,Leckhampton,,Cheltenham,Gloucestershire,GL53 9HD,Tel: 01242512569,No ratings yet Rate it yourself - /Services/careproviders/LeaveReview/DefaultView.aspx?id=1-120087914,0,0,,
Cheltenham Supported Living,1-4961855782,SCL,Charlton Lane,,,Cheltenham,,GL53 9HD,Tel: 01242512569,No ratings yet Rate it yourself - /Services/careproviders/LeaveReview/DefaultView.aspx?id=1-4961855782,0,0,,
National Star College - Ullenwood,1-139161062,SCL,National Star College,Ullenwood,,Cheltenham,Gloucestershire,GL53 9QU,Tel: 01242527631,No ratings yet Rate it yourself - /Services/careproviders/LeaveReview/DefaultView.aspx?id=1-139161062,0,0,,
Hope Care Service Agency,1-12784523902,SCL,"17 Morris Walk, Pilgrove Way",,,Cheltenham,,GL51 0SQ,Tel: 01242382888,No ratings yet Rate it yourself - /Services/careproviders/LeaveReview/DefaultView.aspx?id=1-12784523902,0,0,,
Wentworth Court,1-1955636004,SCL,Village Road,,,Cheltenham,Gloucestershire,GL51 0BG,Tel: 01242 263334,No ratings yet Rate it yourself - /Services/careproviders/LeaveReview/DefaultView.aspx?id=1-1955636004,0,0,,
Fern Court,1-111001511,SCL,Down Hatherley Lane,,,Gloucester,Gloucestershire,GL2 9QB,Tel: 01452730626,No ratings yet Rate it yourself - /Services/careproviders/LeaveReview/DefaultView.aspx?id=1-111001511,0,0,,
Helping Hands Cheltenham,1-10926288707,SCL,Festival House,Jessop Avenue,,Cheltenham,,GL50 3SH,Tel: 01242384637,No ratings yet Rate it yourself - /Services/careproviders/LeaveReview/DefaultView.aspx?id=1-10926288707,0,0,,
Person Centred care,1-1031394829,SCL,Montpellier House,Montpellier Drive,,Cheltenham,Gloucestershire,GL50 1TY,,No ratings yet Rate it yourself - /Services/careproviders/LeaveReview/DefaultView.aspx?id=1-1031394829,0,0,,
Gloucester Homecare Services Ltd,1-1751414999,SCL,139 Corinium House,Barnwood Point,,Gloucester,,GL4 3HX,Tel: 01452549495,1 rating Rate it yourself - /Services/careproviders/LeaveReview/DefaultView.aspx?id=1-1751414999,,,,
Nash Alliance Ltd,1-5227938280,SCL,"Office 249, Corinium House","Barnwood Point Business Park, Corinium Avenue",,Gloucester,,GL4 3HX,Tel: 01452346576,No ratings yet Rate it yourself - /Services/careproviders/LeaveReview/DefaultView.aspx?id=1-5227938280,0,0,,
Coldbrock Healthcare,1-6745369595,SCL,"Corinium House, BIZSPACE","Barnwood Point, Corinium Avenue",,Gloucester,,GL4 3HX,Tel: 07387077266,1 rating Rate it yourself - /Services/careproviders/LeaveReview/DefaultView.aspx?id=1-6745369595,,,,
Aspirations Southwest Adults,1-13778866709,SCL,365 Corinium House,"Barnwood Point, Corinium Avenue",,Gloucester,,GL4 3HX,Tel: 01452835970,No ratings yet Rate it yourself - /Services/careproviders/LeaveReview/DefaultView.aspx?id=1-13778866709,0,0,,
Sky Vigil Care Ltd Gloucester,1-13251401815,SCL,"Unit 129, Corinium House","Barnwood Point, Corinium Avenue",,Gloucester,,GL4 3HX,Tel: 07775690691,No ratings yet Rate it yourself - /Services/careproviders/LeaveReview/DefaultView.aspx?id=1-13251401815,0,0,,
Global Caring Gloucester,1-12076720079,SCL,Global Caring Group Ltd Room 115,"Corinium House, Corinium Avenue",,Gloucester,,GL4 3HX,Tel: 01452345820,No ratings yet Rate it yourself - /Services/careproviders/LeaveReview/DefaultView.aspx?id=1-12076720079,0,0,,
Home Instead - Gloucester and The Forest of Dean,1-9194216710,SCL,Corinium House,"Barnwood Point, Corinium Avenue",,Gloucester,,GL4 3HX,Tel: 01452341975,No ratings yet Rate it yourself - /Services/careproviders/LeaveReview/DefaultView.aspx?id=1-9194216710,0,0,,
Rehoboth Health and Home Care Limited,1-9224642251,SCL,127 Barnwood House,"Corinium Avenue, Barnwood",,Gloucester,,GL4 3HX,Tel: 07427333614,No ratings yet Rate it yourself - /Services/careproviders/LeaveReview/DefaultView.aspx?id=1-9224642251,0,0,,
Your Lifestyle Nationwide Limited,1-2916137509,SCL,"Suite 250, Corinium House","Barnwood Point Business Park, Corinium Avenue",,Gloucester,,GL4 3HX,Tel: 01452729757,No ratings yet Rate it yourself - /Services/careproviders/LeaveReview/DefaultView.aspx?id=1-2916137509,0,0,,
Cott's Care Solutions,1-4301900009,SCL,3 Royal Crescent,,,Cheltenham,,GL50 3DA,Tel: 01242371048,No ratings yet Rate it yourself - /Services/careproviders/LeaveReview/DefaultView.aspx?id=1-4301900009,0,0,,
Retain Healthcare Limited - Cheltenham,1-6906880424,SCL,"8 Ormond Terrace,",Regent Street,,Cheltenham,,GL50 1HR,Tel: 01242262700,No ratings yet Rate it yourself - /Services/careproviders/LeaveReview/DefaultView.aspx?id=1-6906880424,0,0,,
Honeybourne Gate,1-2252521215,SCL,2 Gloucester Road,,,Cheltenham,Gloucestershire,GL51 8DW,Tel: 01242233694,No ratings yet Rate it yourself - /Services/careproviders/LeaveReview/DefaultView.aspx?id=1-2252521215,0,0,,
Orchard Leigh,1-129459945,SCL,Hayden Road,,,Cheltenham,Gloucestershire,GL51 0SN,Tel: 01242523848,No ratings yet Rate it yourself - /Services/careproviders/LeaveReview/DefaultView.aspx?id=1-129459945,0,0,,
Hannacott,1-17595435858,SCL,Abbeymead Avenue,Abbeymead,,Gloucester,Gloucestershire,GL4 5GR,Tel: 03333443095,No ratings yet Rate it yourself - /Services/careproviders/LeaveReview/DefaultView.aspx?id=1-17595435858,0,0,,
Abbeymead Lodge,1-17593433290,SCL,Abbeymead Avenue,Abbeymead,,Gloucester,Gloucestershire,GL4 5GR,Tel: 01452617566,No ratings yet Rate it yourself - /Services/careproviders/LeaveReview/DefaultView.aspx?id=1-17593433290,0,0,,
Thirlestaine Park Care Home,1-1919525815,SCL,Humphris Place,Off Sandford Road,,Cheltenham,Gloucestershire,GL53 7GA,Tel: 01242505560,No ratings yet Rate it yourself - /Services/careproviders/LeaveReview/DefaultView.aspx?id=1-1919525815,0,0,,
Farecare Gloucestershire Limited,1-2177215241,SCL,47 Rodney Road,,,Cheltenham,Gloucestershire,GL50 1HX,Tel: 01242232296,No ratings yet Rate it yourself - /Services/careproviders/LeaveReview/DefaultView.aspx?id=1-2177215241,0,0,,
Saracen Care Services Ltd,1-1260730033,SCL,53-57 Rodney Road,,,Cheltenham,Gloucestershire,GL50 1HX,Tel: 01242515162,2 ratings Rate it yourself - /Services/careproviders/LeaveReview/DefaultView.aspx?id=1-1260730033,,,,
SW Domiciliary Care,1-6720068087,SCL,Harley House,29 Cambray Place,,Cheltenham,,GL50 1JN,Tel: 01242352554,No ratings yet Rate it yourself - /Services/careproviders/LeaveReview/DefaultView.aspx?id=1-6720068087,0,0,,
Jendot,1-132674750,SCL,3 Little Field,Abbeymead,,Gloucester,Gloucestershire,GL4 4QS,Tel: 01452535963,No ratings yet Rate it yourself - /Services/careproviders/LeaveReview/DefaultView.aspx?id=1-132674750,0,0,,
Windrush Care,1-2158325162,SCL,Normandy House,305-309 High Street,,Cheltenham,Gloucestershire,GL50 3HW,Tel: 01242226020,No ratings yet Rate it yourself - /Services/careproviders/LeaveReview/DefaultView.aspx?id=1-2158325162,0,0,,
Machlo,1-132686657,SCL,17 Windmill Field,Abbeymead,,Gloucester,Gloucestershire,GL4 4RQ,Tel: 01452372403,No ratings yet Rate it yourself - /Services/careproviders/LeaveReview/DefaultView.aspx?id=1-132686657,0,0,,
Safehands Recruitment Ltd,1-12061846865,SCL,Manor Park Place,Rutherford Way,,Cheltenham,,GL51 9TU,Tel: 01242505400,No ratings yet Rate it yourself - /Services/careproviders/LeaveReview/DefaultView.aspx?id=1-12061846865,0,0,,
Broomfield Care Home Care Services,1-548043739,SCL,Suite 1 The Business Centre,Innsworth Technology Park,,Gloucester,Gloucestershire,GL3 1DL,Tel: 01452 730888,No ratings yet Rate it yourself - /Services/careproviders/LeaveReview/DefaultView.aspx?id=1-548043739,0,0,,
The Red House,1-2916137583,SCL,25 Barnwood Road,,,Gloucester,Gloucestershire,GL2 0SD,Tel: 01452386896,No ratings yet Rate it yourself - /Services/careproviders/LeaveReview/DefaultView.aspx?id=1-2916137583,0,0,,
Charnwood House Nursing Home,1-11975941355,SCL,49 Barnwood Road,,,Gloucester,Gloucestershire,GL2 0SD,Tel: 01452523478,No ratings yet Rate it yourself - /Services/careproviders/LeaveReview/DefaultView.aspx?id=1-11975941355,0,0,,
Avalon Residential Home,1-2026429788,SCL,17 Barnwood Road,,,Gloucester,,GL2 0RZ,Tel: 01452417400,No ratings yet Rate it yourself - /Services/careproviders/LeaveReview/DefaultView.aspx?id=1-2026429788,0,0,,
Bafford House,1-11601666215,SCL,Bafford House,"Newcourt Road, Charlton Kings",,Cheltenham,,GL53 8DQ,Tel: 01242523562,No ratings yet Rate it yourself - /Services/careproviders/LeaveReview/DefaultView.aspx?id=1-11601666215,0,0,,
Charlton Kings Care Home,1-2897246286,SCL,Moorend Road,Charlton Kings,,Cheltenham,Gloucestershire,GL53 9AX,Tel: 01242 521812,No ratings yet Rate it yourself - /Services/careproviders/LeaveReview/DefaultView.aspx?id=1-2897246286,0,0,,
Profound Housing and Support Ltd,1-15875245386,SCL,21 Ferndale Close,,,Gloucester,,GL2 9RT,,No ratings yet Rate it yourself - /Services/careproviders/LeaveReview/DefaultView.aspx?id=1-15875245386,0,0,,
The Cedars,1-132363977,SCL,144 London Road,,,Gloucester,Gloucestershire,GL2 0RS,Tel: 01452 310727,No ratings yet Rate it yourself - /Services/careproviders/LeaveReview/DefaultView.aspx?id=1-132363977,0,0,,
Bradbury Gardens,1-2148821492,SCL,West Drive,Pittville,,Cheltenham,Gloucestershire,GL50 4LB,Tel: 01242527631,No ratings yet Rate it yourself - /Services/careproviders/LeaveReview/DefaultView.aspx?id=1-2148821492,0,0,,
Horton House Residential Care Home,1-124209037,SCL,1 Horton Road,,,Gloucester,Gloucestershire,GL1 3PX,Tel: 01452524615,No ratings yet Rate it yourself - /Services/careproviders/LeaveReview/DefaultView.aspx?id=1-124209037,0,0,,
Guild House Residential Home,1-118262440,SCL,2A Denmark Road,,,Gloucester,Gloucestershire,GL1 3HW,Tel: 01452525098,No ratings yet Rate it yourself - /Services/careproviders/LeaveReview/DefaultView.aspx?id=1-118262440,0,0,,
Wotton Rise Nursing Home Limited,1-126920694,SCL,140 London Road,,,Gloucester,Gloucestershire,GL1 3PL,Tel: 01452303073,No ratings yet Rate it yourself - /Services/careproviders/LeaveReview/DefaultView.aspx?id=1-126920694,0,0,,
Eastern Lodge,1-13937319933,SCL,104 Eastern Avenue,,,Gloucester,Gloucestershire,GL4 4LW,Tel: 01452505735,No ratings yet Rate it yourself - /Services/careproviders/LeaveReview/DefaultView.aspx?id=1-13937319933,0,0,,
Chapel House Care Centre,1-1334566074,SCL,Horton Road,,,Gloucester,Gloucestershire,GL1 3LE,Tel: 01452500005,No ratings yet Rate it yourself - /Services/careproviders/LeaveReview/DefaultView.aspx?id=1-1334566074,0,0,,
Magdalen House Residential Home,1-118280207,SCL,London Road,,,Gloucester,Gloucestershire,GL1 3PH,Tel: 01452386331,No ratings yet Rate it yourself - /Services/careproviders/LeaveReview/DefaultView.aspx?id=1-118280207,0,0,,
Windsor Street Care Centre,1-723347537,SCL,35-37 Windsor Street,,,Cheltenham,Gloucestershire,GL52 2DG,Tel: 01242545150,No ratings yet Rate it yourself - /Services/careproviders/LeaveReview/DefaultView.aspx?id=1-723347537,0,0,,
Trevone House,1-10529920811,SCL,22 Denmark Road,,,Gloucester,Gloucestershire,GL1 3HZ,Tel: 01452937220,No ratings yet Rate it yourself - /Services/careproviders/LeaveReview/DefaultView.aspx?id=1-10529920811,0,0,,
Saintbridge House Nursing and Residential Home,1-470456880,SCL,189 Painswick Road,Abbeydale,,Gloucester,Gloucestershire,GL4 4QQ,Tel: 01452300307,No ratings yet Rate it yourself - /Services/careproviders/LeaveReview/DefaultView.aspx?id=1-470456880,0,0,,
Nazareth House - Cheltenham,1-403200219,SCL,London Road,Charlton Kings,,Cheltenham,Gloucestershire,GL52 6YJ,Tel: 01242516361,No ratings yet Rate it yourself - /Services/careproviders/LeaveReview/DefaultView.aspx?id=1-403200219,0,0,,
Alexandra House Care Home,1-132363569,SCL,2 Alexandra Road,,,Gloucester,Gloucestershire,GL1 3DR,Tel: 01452 418575,No ratings yet Rate it yourself - /Services/careproviders/LeaveReview/DefaultView.aspx?id=1-132363569,0,0,,
Oakhaven Residential Care Home,1-123788035,SCL,136-140 Hales Road,,,Cheltenham,Gloucestershire,GL52 6TB,Tel: 01242528377,No ratings yet Rate it yourself - /Services/careproviders/LeaveReview/DefaultView.aspx?id=1-123788035,0,0,,
OSJCT Grevill House,1-122144872,SCL,279 London Road,Charlton Kings,,Cheltenham,Gloucestershire,GL52 6YL,Tel: 01242512964,No ratings yet Rate it yourself - /Services/careproviders/LeaveReview/DefaultView.aspx?id=1-122144872,0,0,,
Fern Croft,1-111001496,SCL,14 Heathville Road,,,Gloucester,Gloucestershire,GL1 3DS,Tel: 01452505803,No ratings yet Rate it yourself - /Services/careproviders/LeaveReview/DefaultView.aspx?id=1-111001496,0,0,,
Great Western Court,1-115336861,SCL,33a Millbrook Street,,,Gloucester,Gloucestershire,GL1 4BG,Tel: 01452423495,No ratings yet Rate it yourself - /Services/careproviders/LeaveReview/DefaultView.aspx?id=1-115336861,0,0,,
46 London Road,1-129459157,SCL,Gloucester,,,Gloucester,Gloucestershire,GL1 3NZ,,No ratings yet Rate it yourself - /Services/careproviders/LeaveReview/DefaultView.aspx?id=1-129459157,0,0,,
Lean On Me Care Services Limited,1-12771027531,SCL,40 London Road,,,Gloucester,,GL1 3NU,Tel: 07958649933,No ratings yet Rate it yourself - /Services/careproviders/LeaveReview/DefaultView.aspx?id=1-12771027531,0,0,,
The Dean Neurological Centre,1-13354544438,SCL,Tewkesbury Road,Longford,,Gloucester,Gloucestershire,GL2 9EE,Tel: 01452420200,No ratings yet Rate it yourself - /Services/careproviders/LeaveReview/DefaultView.aspx?id=1-13354544438,0,0,,