Organisation Name,NACS Code,Organisation Type,Address1,Address2,Address3,Address4,Address5,PostCode,Telephone Number,NHS.UK users rating,Value  (NHS.UK users rating),Banding Classification  (NHS.UK users rating),Car parking (Is there car parking at this organisation?),Disabled access (Disabled access)
SureCare Bromley Limited,1-4465650560,SCL,Bencewell Business Centre,Oakley Road,,Bromley,Kent,BR2 8HG,Tel: 02034091626,No ratings yet Rate it yourself - /Services/careproviders/LeaveReview/DefaultView.aspx?id=1-4465650560,0,0,,
Mackley Homecare Limited,1-117070190,SCL,Bencewell Business Centre,Oakley Road,,Bromley,Kent,BR2 8HG,Tel: 02038928700,No ratings yet Rate it yourself - /Services/careproviders/LeaveReview/DefaultView.aspx?id=1-117070190,0,0,,
Right at Home (Bromley),1-3917553912,SCL,Bromley Business Centre,27 Hastings Road,,London,,BR2 8NA,Tel: 020 8150 6272,1 rating Rate it yourself - /Services/careproviders/LeaveReview/DefaultView.aspx?id=1-3917553912,,,,
Mears Care - Bromley,1-8026511168,SCL,Crown Meadow Court,23 Brosse Way,,Bromley,Kent,BR2 8FE,Tel: 02084621006,No ratings yet Rate it yourself - /Services/careproviders/LeaveReview/DefaultView.aspx?id=1-8026511168,0,0,,
Diversity Healthcare,1-4361682261,SCL,9 Archery Lane,,,Bromley,,BR2 9FQ,Tel: 02084986800,No ratings yet Rate it yourself - /Services/careproviders/LeaveReview/DefaultView.aspx?id=1-4361682261,0,0,,
Solving Homes Limited,1-12331943788,SCL,The Beechwood Centre,40 Lower Gravel Road,,Bromley,,BR2 8GP,Tel: 02037709382,No ratings yet Rate it yourself - /Services/careproviders/LeaveReview/DefaultView.aspx?id=1-12331943788,0,0,,
Reliable Community Care Services Ltd,1-12771442086,SCL,Unit 20,"The Beechwood Centre, 40 Lower Gravel Road",,Bromley,,BR2 8GP,Tel: 07983860248,No ratings yet Rate it yourself - /Services/careproviders/LeaveReview/DefaultView.aspx?id=1-12771442086,0,0,,
Caremax Ltd,1-6388358420,SCL,"Suite 21, The Beechwood Centre",40 Lower Gravel Road,,Bromley,,BR2 8GP,Tel: 03301330577,No ratings yet Rate it yourself - /Services/careproviders/LeaveReview/DefaultView.aspx?id=1-6388358420,0,0,,
Creative Support - Regency Court,1-4116308774,SCL,14 Mackintosh Street,,,Bromley,Kent,BR2 9GL,Tel: 02084603142,No ratings yet Rate it yourself - /Services/careproviders/LeaveReview/DefaultView.aspx?id=1-4116308774,0,0,,
"Home Instead - Bromley, Chislehurst & Orpington",1-3108169754,SCL,76 Croydon Road,Coney Hall Village,,West Wickham,,BR4 9HY,Tel: 02086582535,No ratings yet Rate it yourself - /Services/careproviders/LeaveReview/DefaultView.aspx?id=1-3108169754,0,0,,
Always Caring Bromley Limited,1-266779859,SCL,14 Letchworth Drive,,,Bromley,Kent,BR2 9BE,Tel: 02084666133,No ratings yet Rate it yourself - /Services/careproviders/LeaveReview/DefaultView.aspx?id=1-266779859,0,0,,
Bluebird Care Bromley,1-2246993108,SCL,,50c Chatterton Road,,Bromley,Kent,BR2 9QE,Tel: 02083150236,64 ratings Rate it yourself - /Services/careproviders/LeaveReview/DefaultView.aspx?id=1-2246993108,,,,
Bromley,1-3915276101,SCL,27 Ruskin Walk,,,Bromley,Kent,BR2 8EP,,No ratings yet Rate it yourself - /Services/careproviders/LeaveReview/DefaultView.aspx?id=1-3915276101,0,0,,
Toptee Healthcare Services Limited,1-18711632713,SCL,28 Bromley Common,,,Bromley,,BR2 9PD,Tel: 07939343813,No ratings yet Rate it yourself - /Services/careproviders/LeaveReview/DefaultView.aspx?id=1-18711632713,0,0,,
Ashglade,1-127080331,SCL,178 Southborough Lane,,,Bromley,Kent,BR2 8AL,Tel: 02084670640,No ratings yet Rate it yourself - /Services/careproviders/LeaveReview/DefaultView.aspx?id=1-127080331,0,0,,
Home Care & Support Limited,1-865267331,SCL,"First Floor Suite, St Luke's Hall",Raglan Road,,Bromley,,BR2 9NN,Tel: 02045417116,No ratings yet Rate it yourself - /Services/careproviders/LeaveReview/DefaultView.aspx?id=1-865267331,0,0,,
Abacus Homecare (Bromley) Ltd,1-1195626726,SCL,40 Larch Way,,,Bromley,Kent,BR2 8DU,Tel: 07442503520,No ratings yet Rate it yourself - /Services/careproviders/LeaveReview/DefaultView.aspx?id=1-1195626726,0,0,,
Coloma Court Care Home,1-112968840,SCL,Layhams Road,,,West Wickham,Kent,BR4 9QJ,Tel: 02087761129,No ratings yet Rate it yourself - /Services/careproviders/LeaveReview/DefaultView.aspx?id=1-112968840,0,0,,
Homesdale Supported Living,1-11296003795,SCL,30 Homesdale Road,,,Bromley,,BR2 9LD,Tel: 02082492902,No ratings yet Rate it yourself - /Services/careproviders/LeaveReview/DefaultView.aspx?id=1-11296003795,0,0,,
Voug Care,1-14808116929,SCL,40,Homesdale Road,,Bromley,,BR2 9LD,Tel: 02084607468,No ratings yet Rate it yourself - /Services/careproviders/LeaveReview/DefaultView.aspx?id=1-14808116929,0,0,,
Gracious Care,1-9775304484,SCL,Willow Walk Business Centre,8 - 10 Willow Walk,,Orpington,,BR6 7AA,,No ratings yet Rate it yourself - /Services/careproviders/LeaveReview/DefaultView.aspx?id=1-9775304484,0,0,,
4 Sandford Road,1-3040229752,SCL,4 Sandford Road,,,Bromley,Kent,BR2 9AW,Tel: 02083131017,No ratings yet Rate it yourself - /Services/careproviders/LeaveReview/DefaultView.aspx?id=1-3040229752,0,0,,
Elmwood,1-128976502,SCL,42 Southborough Road,Bickley,,Bromley,Kent,BR1 2EN,Tel: 02082491904,No ratings yet Rate it yourself - /Services/careproviders/LeaveReview/DefaultView.aspx?id=1-128976502,0,0,,
Beechmore Court,1-108969188,SCL,267 Southlands Road,,,Bromley,Kent,BR1 2EG,Tel: 02084687778,No ratings yet Rate it yourself - /Services/careproviders/LeaveReview/DefaultView.aspx?id=1-108969188,0,0,,
Homefield,1-128976515,SCL,1 Lime Close,,,Bromley,,BR1 2EF,Tel: 02082897932,No ratings yet Rate it yourself - /Services/careproviders/LeaveReview/DefaultView.aspx?id=1-128976515,0,0,,
Queen Elizabeth House,1-121567230,SCL,38 Southborough Road,Bickley,,Bromley,Kent,BR1 2EE,Tel: 02084673994,No ratings yet Rate it yourself - /Services/careproviders/LeaveReview/DefaultView.aspx?id=1-121567230,0,0,,
Smithfield Health & Social Care Limited t/a Verilife,1-303534961,SCL,363 Southborough Lane,,,Bromley,Kent,BR2 8BQ,Tel: 02031419290,No ratings yet Rate it yourself - /Services/careproviders/LeaveReview/DefaultView.aspx?id=1-303534961,0,0,,
Christoolas Limited,1-18214851066,SCL,1 Elmfield Park,,,Bromley,,BR1 1LU,,No ratings yet Rate it yourself - /Services/careproviders/LeaveReview/DefaultView.aspx?id=1-18214851066,0,0,,
Calabs Services Limited,1-18224065205,SCL,Regus - London Bromley South,1 Elmfield Park,,Bromley,,BR1 1LU,Tel: 07944985279,No ratings yet Rate it yourself - /Services/careproviders/LeaveReview/DefaultView.aspx?id=1-18224065205,0,0,,
Robins Care Ltd,1-13747953957,SCL,Regus Offices,1 Elmfield Park,,Bromley,,BR1 1LU,Tel: 02080589505,1 rating Rate it yourself - /Services/careproviders/LeaveReview/DefaultView.aspx?id=1-13747953957,,,,
Rooted Homecare,1-16371917836,SCL,1 Elmfield Park,,,Bromley,,BR1 1LU,,No ratings yet Rate it yourself - /Services/careproviders/LeaveReview/DefaultView.aspx?id=1-16371917836,0,0,,
Billioncare Ltd,1-17596327681,SCL,1 Elmfield Park,Regus Building,,Bromley,,BR1 1LU,Tel: 02086980222,No ratings yet Rate it yourself - /Services/careproviders/LeaveReview/DefaultView.aspx?id=1-17596327681,0,0,,
Profad Care Agency Bromley,1-13946622674,SCL,1 Elmfield Park,,,Bromley,,BR1 1LU,,No ratings yet Rate it yourself - /Services/careproviders/LeaveReview/DefaultView.aspx?id=1-13946622674,0,0,,
RedPanda Care Main Office,1-10887924151,SCL,"Regus, 1 Elmfield Park",,,Bromley,,BR1 1LU,Tel: 02071014971,No ratings yet Rate it yourself - /Services/careproviders/LeaveReview/DefaultView.aspx?id=1-10887924151,0,0,,
Regus,1-2817026518,SCL,1 Elmfield Park,,,Bromley,,BR1 1LU,Tel: 02070787383,No ratings yet Rate it yourself - /Services/careproviders/LeaveReview/DefaultView.aspx?id=1-2817026518,0,0,,
Head office,1-9323535289,SCL,Wells House 15-17,Elmfield Road,,Bromley,,BR1 1LT,Tel: 02084687888,No ratings yet Rate it yourself - /Services/careproviders/LeaveReview/DefaultView.aspx?id=1-9323535289,0,0,,
London & South East Domiciliary Care Branch (Mental Health),1-3040078062,SCL,"Office No. 29, Kingfisher House Business Centre",21-23 Elmfield Road,,Bromley,,BR1 1LT,Tel: 02083139725,No ratings yet Rate it yourself - /Services/careproviders/LeaveReview/DefaultView.aspx?id=1-3040078062,0,0,,
London and South East Domiciliary Care Branch (Learning Disability),1-1839972206,SCL,"Office No. 29, Kingfisher House Business Centre",21-23 Elmfield Road,,Bromley,,BR1 1LT,Tel: 02085023933,No ratings yet Rate it yourself - /Services/careproviders/LeaveReview/DefaultView.aspx?id=1-1839972206,0,0,,
Burrell Mead,1-109761925,SCL,47 Beckenham Road,,,West Wickham,Kent,BR4 0QS,Tel: 02087760455,No ratings yet Rate it yourself - /Services/careproviders/LeaveReview/DefaultView.aspx?id=1-109761925,0,0,,
River Garden Care,1-1865507935,SCL,South Tower,26 Elmfield Road,,Bromley,Kent,BR1 1LR,Tel: 02084609571,1 rating Rate it yourself - /Services/careproviders/LeaveReview/DefaultView.aspx?id=1-1865507935,,,,
Home Care,1-176333932,SCL,North Block,Stockwell Close,,Bromley,Kent,BR1 3UH,Tel: 02083134072,No ratings yet Rate it yourself - /Services/careproviders/LeaveReview/DefaultView.aspx?id=1-176333932,0,0,,
Care Outlook (West Wickham),1-745039062,SCL,128 High Street,,,West Wickham,Kent,BR4 0LZ,Tel: 02087773840,1 rating Rate it yourself - /Services/careproviders/LeaveReview/DefaultView.aspx?id=1-745039062,,,,
Queens Court,1-14390315792,SCL,21 Bickley Road,,,Bromley,Kent,BR1 2ND,Tel: 02084687440,No ratings yet Rate it yourself - /Services/careproviders/LeaveReview/DefaultView.aspx?id=1-14390315792,0,0,,
KYN Bickley,1-14863445898,SCL,Bickley Park Road,,,Bromley,Kent,BR1 2AZ,Tel: 0205309700,No ratings yet Rate it yourself - /Services/careproviders/LeaveReview/DefaultView.aspx?id=1-14863445898,0,0,,
118 Widmore Road,1-10858801772,SCL,118 Widmore Road,,,Bromley,Kent,BR1 3BE,Tel: 02084643920,No ratings yet Rate it yourself - /Services/careproviders/LeaveReview/DefaultView.aspx?id=1-10858801772,0,0,,
TUcare,1-5537977391,SCL,167a Widmore Road,,,London,,BR1 3AX,Tel: 020 8325 2285,No ratings yet Rate it yourself - /Services/careproviders/LeaveReview/DefaultView.aspx?id=1-5537977391,0,0,,
Chislehurst Homecare Partnership,1-145353745,SCL,The Mews 3 Church Road,Farnborough Village,,Orpington,,BR6 7DB,Tel: 07484734525,No ratings yet Rate it yourself - /Services/careproviders/LeaveReview/DefaultView.aspx?id=1-145353745,0,0,,
Tanglewood,1-151774304,SCL,66 Leaves Green Road,Keston,,Bromley,Kent,BR2 6DQ,Tel: 01689850642,No ratings yet Rate it yourself - /Services/careproviders/LeaveReview/DefaultView.aspx?id=1-151774304,0,0,,
Clairleigh Nursing Home,1-106338834,SCL,104 Plaistow Lane,,,Bromley,Kent,BR1 3AS,Tel: 02084601527,No ratings yet Rate it yourself - /Services/careproviders/LeaveReview/DefaultView.aspx?id=1-106338834,0,0,,
Plum Care,1-5300464641,SCL,"Compass House, Suite B",36 East Street,,Bromley,,BR1 1QU,Tel: 02039152448,No ratings yet Rate it yourself - /Services/careproviders/LeaveReview/DefaultView.aspx?id=1-5300464641,0,0,,
Bromley,1-2598387861,SCL,Kent House,41 East Street,,Bromley,Kent,BR1 1QQ,Tel: 07496641109,No ratings yet Rate it yourself - /Services/careproviders/LeaveReview/DefaultView.aspx?id=1-2598387861,0,0,,
Enriched Lives Limited - Main Office,1-18392555751,SCL,Commercial House,2/2a Newman Road,,Bromley,,BR1 1RJ,,No ratings yet Rate it yourself - /Services/careproviders/LeaveReview/DefaultView.aspx?id=1-18392555751,0,0,,
Sanctuary Supported Living (Bromley Care Services),1-7020387845,SCL,17/17a Park Road,,,Bromley,,BR1 3HJ,Tel: 02084668177,No ratings yet Rate it yourself - /Services/careproviders/LeaveReview/DefaultView.aspx?id=1-7020387845,0,0,,
Nettlestead Care Home,1-111375413,SCL,19 Sundridge Avenue,,,Bromley,Kent,BR1 2PU,Tel: 02084602279,No ratings yet Rate it yourself - /Services/careproviders/LeaveReview/DefaultView.aspx?id=1-111375413,0,0,,
Nightingale Home Care,1-111375442,SCL,The Coach House,19 Sundridge Avenue,,Bromley,Kent,BR1 2PU,Tel: 02084669664,No ratings yet Rate it yourself - /Services/careproviders/LeaveReview/DefaultView.aspx?id=1-111375442,0,0,,
Sunnyside Domicilliary Support Services Limited,1-210091055,SCL,7 Dunstonian Court,28a Station Square,,Orpington,,BR5 1NA,Tel: 01689638236,No ratings yet Rate it yourself - /Services/careproviders/LeaveReview/DefaultView.aspx?id=1-210091055,0,0,,
Beckenham Park Care Home,1-15519796030,SCL,2 Roman Way,,,Beckenham,,BR3 3FH,Tel: 02031313010,No ratings yet Rate it yourself - /Services/careproviders/LeaveReview/DefaultView.aspx?id=1-15519796030,0,0,,
Beckenham Park Care Home,1-12383242864,SCL,2 Roman Way,,,Beckenham,,BR3 3FH,,No ratings yet Rate it yourself - /Services/careproviders/LeaveReview/DefaultView.aspx?id=1-12383242864,0,0,,
Enabled Health Limited,1-6411395638,SCL,"Biz Space, Unit 4, Addington Business Centre","Vulcan Way, New Addington",,Croydon,,CR0 9UG,Tel: 01689846216,No ratings yet Rate it yourself - /Services/careproviders/LeaveReview/DefaultView.aspx?id=1-6411395638,0,0,,
Springfield - Care Home Physical Disabilities,1-120087412,SCL,69 Freelands Road,,,Bromley,Kent,BR1 3HZ,Tel: 02084668158,No ratings yet Rate it yourself - /Services/careproviders/LeaveReview/DefaultView.aspx?id=1-120087412,0,0,,
St Cecilia's - Care Home with Nursing Physical Disabilities,1-120088056,SCL,32 Sundridge Avenue,,,Bromley,Kent,BR1 2PZ,Tel: 02084608377,No ratings yet Rate it yourself - /Services/careproviders/LeaveReview/DefaultView.aspx?id=1-120088056,0,0,,
The Heathers Residential Care Home,1-121650185,SCL,35 Farnaby Road,,,Bromley,Kent,BR1 4BL,,No ratings yet Rate it yourself - /Services/careproviders/LeaveReview/DefaultView.aspx?id=1-121650185,0,0,,
Blyth House,1-127080346,SCL,16 Blyth Road,,,Bromley,Kent,BR1 3RX,Tel: 02084603070,No ratings yet Rate it yourself - /Services/careproviders/LeaveReview/DefaultView.aspx?id=1-127080346,0,0,,
No 66 - High View Care Services,1-6372060237,SCL,66 Plaistow Lane,,,Bromley,Kent,BR1 3JE,Tel: 02030267800,No ratings yet Rate it yourself - /Services/careproviders/LeaveReview/DefaultView.aspx?id=1-6372060237,0,0,,
Kentish Homecare Agency Limited,1-118876341,SCL,106b Wickham Road,,,Beckenham,Kent,BR3 6QH,Tel: 020 8658 4455,1 rating Rate it yourself - /Services/careproviders/LeaveReview/DefaultView.aspx?id=1-118876341,,,,
Care Carers,1-7486285682,SCL,3 Warbank Crescent,New Addington,,Croydon,,CR0 0AY,Tel: 07956623937,No ratings yet Rate it yourself - /Services/careproviders/LeaveReview/DefaultView.aspx?id=1-7486285682,0,0,,
Jansondean Care Home,1-191454293,SCL,56 Oakwood Avenue,,,Beckenham,Kent,BR3 6PJ,Tel: 02086507810,No ratings yet Rate it yourself - /Services/careproviders/LeaveReview/DefaultView.aspx?id=1-191454293,0,0,,
Oak Lodge Care Home,1-17196194664,SCL,28 Oakwood Avenue,,,Beckenham,Kent,BR3 6PJ,Tel: 02086901215,No ratings yet Rate it yourself - /Services/careproviders/LeaveReview/DefaultView.aspx?id=1-17196194664,0,0,,
Cherry Blossom Community Care Ltd,1-13227498052,SCL,47 Windham Avenue,New Addington,,Croydon,,CR0 0HZ,Tel: 01689610505,No ratings yet Rate it yourself - /Services/careproviders/LeaveReview/DefaultView.aspx?id=1-13227498052,0,0,,
Meggie Care Recruitment Limited,1-17192376059,SCL,103 Hope Park,,,Bromley,,BR1 3RG,,No ratings yet Rate it yourself - /Services/careproviders/LeaveReview/DefaultView.aspx?id=1-17192376059,0,0,,
Gap Care Ltd,1-15013296920,SCL,4 Popes Grove,,,Croydon,,CR0 8AX,Tel: 07751499392,No ratings yet Rate it yourself - /Services/careproviders/LeaveReview/DefaultView.aspx?id=1-15013296920,0,0,,
Bromley Park Dementia Nursing Home,1-122186224,SCL,75 Bromley Road,,,Beckenham,Kent,BR3 5PA,Tel: 02086505504,1 rating Rate it yourself - /Services/careproviders/LeaveReview/DefaultView.aspx?id=1-122186224,,,,
Sundridge Court Nursing Home,1-912281599,SCL,19 Edward Road,,,Bromley,Kent,BR1 3NG,Tel: 02084666553,No ratings yet Rate it yourself - /Services/careproviders/LeaveReview/DefaultView.aspx?id=1-912281599,0,0,,
Oliveheal Healthcare Ltd,1-11938653700,SCL,88 Parkway,New Addington,,Croydon,,CR0 0LA,Tel: 07868967152,No ratings yet Rate it yourself - /Services/careproviders/LeaveReview/DefaultView.aspx?id=1-11938653700,0,0,,
Greenhill,1-128976545,SCL,5 Oaklands Road,,,Bromley,Kent,BR1 3SJ,Tel: 02082909130,No ratings yet Rate it yourself - /Services/careproviders/LeaveReview/DefaultView.aspx?id=1-128976545,0,0,,
UBA Care Limited,1-13311194186,SCL,1 North Downs Crescent,New Addington,,Croydon,,CR0 0LG,,No ratings yet Rate it yourself - /Services/careproviders/LeaveReview/DefaultView.aspx?id=1-13311194186,0,0,,
Park Avenue Care Home,1-122198058,SCL,69 Park Avenue,,,Bromley,Kent,BR1 4EW,Tel: 02084665267,No ratings yet Rate it yourself - /Services/careproviders/LeaveReview/DefaultView.aspx?id=1-122198058,0,0,,
St Edwards Close,1-134620892,SCL,6 St Edwards Close,New Addington,,Croydon,Surrey,CR0 0EL,Tel: 01689800960,No ratings yet Rate it yourself - /Services/careproviders/LeaveReview/DefaultView.aspx?id=1-134620892,0,0,,
Diagrama Supported Living,1-10631728583,SCL,3A Healy Drive,,,Orpington,Kent,BR6 9LB,Tel: 01689891401,No ratings yet Rate it yourself - /Services/careproviders/LeaveReview/DefaultView.aspx?id=1-10631728583,0,0,,
Cabrini House 3 (Diagrama Healthcare),1-1875185341,SCL,3 Healy Drive,,,Orpington,Kent,BR6 9LB,Tel: 01689891401,No ratings yet Rate it yourself - /Services/careproviders/LeaveReview/DefaultView.aspx?id=1-1875185341,0,0,,
Cabrini House 1 (Diagrama Healthcare),1-1875164088,SCL,1 Healy Drive,,,Orpington,Kent,BR6 9LB,Tel: 01689891401,No ratings yet Rate it yourself - /Services/careproviders/LeaveReview/DefaultView.aspx?id=1-1875164088,0,0,,
Cabrini House 2 (Diagrama Healthcare),1-2315394292,SCL,2 Healy Drive,,,Orpington,Kent,BR6 9LB,Tel: 01689891401,No ratings yet Rate it yourself - /Services/careproviders/LeaveReview/DefaultView.aspx?id=1-2315394292,0,0,,
Florence Nursing Home,1-2501426602,SCL,47 Park Avenue,,,Bromley,Kent,BR1 4EG,Tel: 02084605695,No ratings yet Rate it yourself - /Services/careproviders/LeaveReview/DefaultView.aspx?id=1-2501426602,0,0,,
Addington Heights,1-259940364,SCL,1 Milne Park West,New Addington,,Croydon,,CR0 0DN,Tel: 03333218261,No ratings yet Rate it yourself - /Services/careproviders/LeaveReview/DefaultView.aspx?id=1-259940364,0,0,,
Wickham Road,1-5464169635,SCL,330 Wickham Road,,,Croydon,,CR0 8BH,Tel: 020 8777 0233,No ratings yet Rate it yourself - /Services/careproviders/LeaveReview/DefaultView.aspx?id=1-5464169635,0,0,,
Day to Day Care Limited,1-2890688735,SCL,First Floor Offices,350 High Street,,Orpington,Kent,BR6 0NQ,Tel: 01689897774,2 ratings Rate it yourself - /Services/careproviders/LeaveReview/DefaultView.aspx?id=1-2890688735,,,,
33 Albemarle Road,1-3040229809,SCL,33 Albemarle Road,,,Beckenham,Kent,BR3 5HL,Tel: 02086636225,No ratings yet Rate it yourself - /Services/careproviders/LeaveReview/DefaultView.aspx?id=1-3040229809,0,0,,
Frylands Court,1-8048221703,SCL,24 Hutchingsons Road,New Addington,,Croydon,,CR0 0BD,Tel: 07436032599,No ratings yet Rate it yourself - /Services/careproviders/LeaveReview/DefaultView.aspx?id=1-8048221703,0,0,,
Opal Carers Ltd,1-9791482096,SCL,40 Thorpe Close,New Addington,,Croydon,,CR0 0SG,Tel: 07914020327,No ratings yet Rate it yourself - /Services/careproviders/LeaveReview/DefaultView.aspx?id=1-9791482096,0,0,,
Home Healthcare/Capable Care,1-12435382652,SCL,167 High Street,,,Beckenham,,BR3 1AE,Tel: 02086507264,No ratings yet Rate it yourself - /Services/careproviders/LeaveReview/DefaultView.aspx?id=1-12435382652,0,0,,
Foxbridge House,1-651388922,SCL,Sevenoaks Road,Pratts Bottom,,Orpington,Kent,BR6 7FB,Tel: 03333210926,No ratings yet Rate it yourself - /Services/careproviders/LeaveReview/DefaultView.aspx?id=1-651388922,0,0,,
73 Repton Road,1-3040078634,SCL,73 Repton Road,,,Orpington,Kent,BR6 9HT,Tel: 01689836661,No ratings yet Rate it yourself - /Services/careproviders/LeaveReview/DefaultView.aspx?id=1-3040078634,0,0,,
Helping Hands Bromley,1-2647984594,SCL,3 Walden Parade,Walden Road,,Chislehurst,Kent,BR7 5DW,Tel: 02081507514,No ratings yet Rate it yourself - /Services/careproviders/LeaveReview/DefaultView.aspx?id=1-2647984594,0,0,,
Yourlife (Chislehurst),1-6468086698,SCL,Shepheards House,Manor Park Road,,Chislehurst,Kent,BR7 5FT,Tel: 02082951251,No ratings yet Rate it yourself - /Services/careproviders/LeaveReview/DefaultView.aspx?id=1-6468086698,0,0,,
Elmes Homecare,1-4518469173,SCL,46 Church Avenue,,,Beckenham,,BR3 1DT,Tel: 02086587285,No ratings yet Rate it yourself - /Services/careproviders/LeaveReview/DefaultView.aspx?id=1-4518469173,0,0,,
Highlands Care Ltd,1-10153383469,SCL,23 Footbury Hill Road,,,Orpington,Kent,BR6 0HP,Tel: 07931325755,No ratings yet Rate it yourself - /Services/careproviders/LeaveReview/DefaultView.aspx?id=1-10153383469,0,0,,
Gravel Hill,1-15914396054,SCL,6 Gravel Hill,,,Croydon,,CR0 5BB,Tel: 03332226699,No ratings yet Rate it yourself - /Services/careproviders/LeaveReview/DefaultView.aspx?id=1-15914396054,0,0,,
Carepoint Services (Beckenham),1-6056948539,SCL,239 High Street,,,Beckenham,,BR3 1BN,Tel: 02086983661,No ratings yet Rate it yourself - /Services/careproviders/LeaveReview/DefaultView.aspx?id=1-6056948539,0,0,,
Melburay Ltd,1-8788300774,SCL,"Unit 2.5, Donna Alexandra Mews",Royal Parade,,Chislehurst,,BR7 6NR,Tel: 02037311088,No ratings yet Rate it yourself - /Services/careproviders/LeaveReview/DefaultView.aspx?id=1-8788300774,0,0,,
London,1-18139132464,SCL,"166 Osward, Court Wood Lane",Forestdale,,Croydon,,CR0 9HE,,No ratings yet Rate it yourself - /Services/careproviders/LeaveReview/DefaultView.aspx?id=1-18139132464,0,0,,
Hall Grange,1-2412195088,SCL,Shirley Church Road,,,Croydon,Surrey,CR9 5AL,Tel: 02086541708,No ratings yet Rate it yourself - /Services/careproviders/LeaveReview/DefaultView.aspx?id=1-2412195088,0,0,,
Compassion Home Care Limited,1-883936252,SCL,"1st Floor, East Wing, Priory Buildings","The Priory, Church Hill",,Orpington,,BR6 0HH,Tel: 01689825155,No ratings yet Rate it yourself - /Services/careproviders/LeaveReview/DefaultView.aspx?id=1-883936252,0,0,,
Support Point Healthcare Services,1-15977192724,SCL,3 The Dene,Upper Shirley Road,,Croydon,,CR0 5HA,Tel: 07908137437,No ratings yet Rate it yourself - /Services/careproviders/LeaveReview/DefaultView.aspx?id=1-15977192724,0,0,,
Elmstead Care Home,1-130120365,SCL,104 Elmstead Lane,,,Chislehurst,Kent,BR7 5EL,Tel: 02034680974,No ratings yet Rate it yourself - /Services/careproviders/LeaveReview/DefaultView.aspx?id=1-130120365,0,0,,
An Diadan House,1-2285106009,SCL,25 Shirley Hills Road,,,Croydon,Surrey,CR0 5HQ,Tel: 02086546429,No ratings yet Rate it yourself - /Services/careproviders/LeaveReview/DefaultView.aspx?id=1-2285106009,0,0,,
Chislehurst Healthcare Ltd,1-11188426198,SCL,39 High Street,,,Chislehurst,,BR7 5AE,Tel: 08006894171,No ratings yet Rate it yourself - /Services/careproviders/LeaveReview/DefaultView.aspx?id=1-11188426198,0,0,,
Antokol,1-110197479,SCL,45 Holbrook Lane,,,Chislehurst,Kent,BR7 6PE,Tel: 02084678102,2 ratings Rate it yourself - /Services/careproviders/LeaveReview/DefaultView.aspx?id=1-110197479,,,,
Fallowfield,1-119778726,SCL,Ashfield Lane,,,Chislehurst,Kent,BR7 6LQ,Tel: 02084672781,No ratings yet Rate it yourself - /Services/careproviders/LeaveReview/DefaultView.aspx?id=1-119778726,0,0,,
Fairlight,1-9405286125,SCL,Bromley Lane,,,Chislehurst,,BR7 6LL,Tel: 02039171523,No ratings yet Rate it yourself - /Services/careproviders/LeaveReview/DefaultView.aspx?id=1-9405286125,0,0,,
Bromley Mind - Mindcare,1-124919305,SCL,20B Hayne Road,,,Beckenham,Kent,BR3 4HY,Tel: 01689811222,No ratings yet Rate it yourself - /Services/careproviders/LeaveReview/DefaultView.aspx?id=1-124919305,0,0,,
Norton Court and Durham House,1-8027735588,SCL,Hayne Road,,,Beckenham,Kent,BR3 4XF,Tel: 08706071400,No ratings yet Rate it yourself - /Services/careproviders/LeaveReview/DefaultView.aspx?id=1-8027735588,0,0,,