Organisation Name,NACS Code,Organisation Type,Address1,Address2,Address3,Address4,Address5,PostCode,Telephone Number,NHS.UK users rating,Value  (NHS.UK users rating),Banding Classification  (NHS.UK users rating),Car parking (Is there car parking at this organisation?),Disabled access (Disabled access)
Glebe Farm,1-4994053831,SCL,Green Lane,Upton,,Huntingdon,,PE28 5YE,Tel: 01480702702,No ratings yet Rate it yourself - /Services/careproviders/LeaveReview/DefaultView.aspx?id=1-4994053831,0,0,,
Oakleigh Care Homes Limited,1-215781949,SCL,Oakleigh Residential Home,22 North Road,,Huntingdon,Cambridgeshire,PE28 4JR,Tel: 01480890248,No ratings yet Rate it yourself - /Services/careproviders/LeaveReview/DefaultView.aspx?id=1-215781949,0,0,,
Hill View,1-116788686,SCL,46 St Judiths Lane,Sawtry,,Huntingdon,Cambridgeshire,PE28 5XE,Tel: 01487831709,No ratings yet Rate it yourself - /Services/careproviders/LeaveReview/DefaultView.aspx?id=1-116788686,0,0,,
Haven Solutionz Ltd,1-18177246802,SCL,75 Peacock Drive,Sawtry,,Huntingdon,,PE28 5WE,Tel: 07711919095,No ratings yet Rate it yourself - /Services/careproviders/LeaveReview/DefaultView.aspx?id=1-18177246802,0,0,,
Cambridgeshire,1-15070717022,SCL,Gibson House,"2 Lancaster Way, Ermine Business Park",,Huntingdon,,PE29 6XU,Tel: 07490530005,No ratings yet Rate it yourself - /Services/careproviders/LeaveReview/DefaultView.aspx?id=1-15070717022,0,0,,
Frontal Care Ltd,1-9640882905,SCL,Gibson House,"2 Lancaster Way, Ermine Business Park",,Huntingdon,,PE29 6XU,Tel: 01480509200,No ratings yet Rate it yourself - /Services/careproviders/LeaveReview/DefaultView.aspx?id=1-9640882905,0,0,,
Rainbow Outreach and Healthcare Solutions Limited Cambridgeshire,1-8583912088,SCL,"Gibson House, Ermine Business Park",Lancaster Way,,Huntingdon,,PE29 6XU,Tel: 07389194433,No ratings yet Rate it yourself - /Services/careproviders/LeaveReview/DefaultView.aspx?id=1-8583912088,0,0,,
Ranis Healthcare Limited,1-7688393371,SCL,Gibson House,"2 Lancaster Way, Ermine Business Park",,Huntingdon,,PE29 6XU,Tel: 01223597892,No ratings yet Rate it yourself - /Services/careproviders/LeaveReview/DefaultView.aspx?id=1-7688393371,0,0,,
Bridging Gaps Services,1-9073730373,SCL,Gibson House,"2 Lancaster Way, Ermine Business Park",,Huntingdon,,PE29 6XU,Tel: 07595972817,No ratings yet Rate it yourself - /Services/careproviders/LeaveReview/DefaultView.aspx?id=1-9073730373,0,0,,
Alpha Health & Social Care Services Cambridgeshire,1-11384475125,SCL,"Gibson House, Suite 136","Ermine Business Park, Lancaster Way",,Huntingdon,,PE29 6XU,Tel: 03335774565,No ratings yet Rate it yourself - /Services/careproviders/LeaveReview/DefaultView.aspx?id=1-11384475125,0,0,,
Support 4 u healthcare,1-7209182374,SCL,Gibson House,"2 Lancaster Way, Ermine Business Park",,Huntingdon,,PE29 6XU,Tel: 01480597317,No ratings yet Rate it yourself - /Services/careproviders/LeaveReview/DefaultView.aspx?id=1-7209182374,0,0,,
Huntingdon,1-12771841561,SCL,"Gibson House, Room 139","2 Lancaster Way, Ermine Business Park",,Huntingdon,,PE29 6XU,Tel: 07966056929,No ratings yet Rate it yourself - /Services/careproviders/LeaveReview/DefaultView.aspx?id=1-12771841561,0,0,,
Four Oaks Healthcare Limited,1-12635547862,SCL,Gibson House,"2 Lancaster Way, Ermine Business Park",,Huntingdon,,PE29 6XU,Tel: 03337720156,1 rating Rate it yourself - /Services/careproviders/LeaveReview/DefaultView.aspx?id=1-12635547862,,,,
Home Instead Senior Care Huntingdon,1-426136631,SCL,1 Ramsay Court,Hinchingbrooke Business Park,,Huntingdon,Cambridgeshire,PE29 6FY,,No ratings yet Rate it yourself - /Services/careproviders/LeaveReview/DefaultView.aspx?id=1-426136631,0,0,,
Radis Community Care (Huntingdon),1-300474330,SCL,Cirrus House,Glebe Road,,Huntingdon,Cambridgeshire,PE29 7DL,Tel: 01480433880,No ratings yet Rate it yourself - /Services/careproviders/LeaveReview/DefaultView.aspx?id=1-300474330,0,0,,
Hill House,1-122505502,SCL,High Street,Ellington,,Huntingdon,Cambridgeshire,PE28 0AG,Tel: 01480890324,1 rating Rate it yourself - /Services/careproviders/LeaveReview/DefaultView.aspx?id=1-122505502,,,,
FitzRoy Supported Living - Cambridgeshire,1-120634924,SCL,Mayfield Heath Farm,"Sapley Road,",Kings Ripton,Huntingdon,Cambridgeshire,PE28 2NX,,No ratings yet Rate it yourself - /Services/careproviders/LeaveReview/DefaultView.aspx?id=1-120634924,0,0,,
The Chase Care Home,1-16862076920,SCL,Medway Road,,,Huntingdon,,PE29 1SF,Tel: 01480278080,No ratings yet Rate it yourself - /Services/careproviders/LeaveReview/DefaultView.aspx?id=1-16862076920,0,0,,
Primrose Hill Care Home,1-151240773,SCL,Thames Road,,,Huntingdon,Cambridgeshire,PE29 1QW,Tel: 01480450099,No ratings yet Rate it yourself - /Services/careproviders/LeaveReview/DefaultView.aspx?id=1-151240773,0,0,,
Ferrars Hall Care Home,1-10291602375,SCL,14 Ferrars Road,,,Huntingdon,,PE29 3AA,Tel: 01480 456 359,No ratings yet Rate it yourself - /Services/careproviders/LeaveReview/DefaultView.aspx?id=1-10291602375,0,0,,
Cambridgeshire County Council - 6 St Lukes Close Huntingdon,1-131631198,SCL,6 St Lukes Close,,,Huntingdon,Cambridgeshire,PE29 1JT,Tel: 01480456941,No ratings yet Rate it yourself - /Services/careproviders/LeaveReview/DefaultView.aspx?id=1-131631198,0,0,,
Huntingdon Supported Living Scheme,1-1744830349,SCL,6 St Lukes Close,,,Huntingdon,Cambridgeshire,PE29 1JT,Tel: 01480456941,No ratings yet Rate it yourself - /Services/careproviders/LeaveReview/DefaultView.aspx?id=1-1744830349,0,0,,
Hunts Mencap Hub,1-3244182650,SCL,Ashton House,Ambury Road South,,Huntingdon,,PE29 3EH,Tel: 01480450596,No ratings yet Rate it yourself - /Services/careproviders/LeaveReview/DefaultView.aspx?id=1-3244182650,0,0,,
Radis Community Care (Park View),1-11415073047,SCL,Park View,Brookside,,Huntingdon,,PE29 1AF,Tel: 01480455411,No ratings yet Rate it yourself - /Services/careproviders/LeaveReview/DefaultView.aspx?id=1-11415073047,0,0,,
"Lilyrose Care Group Ltd, Cambridge",1-6128345020,SCL,"Suite B, 90/91 High Street",,,Huntingdon,,PE29 3DP,Tel: 07760302903,No ratings yet Rate it yourself - /Services/careproviders/LeaveReview/DefaultView.aspx?id=1-6128345020,0,0,,
Cromwell House Care Home,1-137631329,SCL,82 High street,,,Huntingdon,Cambridgeshire,PE29 3DP,Tel: 01480411411,No ratings yet Rate it yourself - /Services/careproviders/LeaveReview/DefaultView.aspx?id=1-137631329,0,0,,
The Manor - Care Home Physical Disabilities,1-120087996,SCL,Church Road,Brampton,,Huntingdon,Cambridgeshire,PE28 4PF,Tel: 01480412412,No ratings yet Rate it yourself - /Services/careproviders/LeaveReview/DefaultView.aspx?id=1-120087996,0,0,,
Community Support Service,1-258712695,SCL,Buttsgrove Centre,38  Buttsgrove Way,,Huntingdon,Cambridgeshire,PE29 1LY,Tel: 01480379800,No ratings yet Rate it yourself - /Services/careproviders/LeaveReview/DefaultView.aspx?id=1-258712695,0,0,,
Montague House,1-12082815020,SCL,Keeling Lane,Brampton,,Huntingdon,,PE28 4BS,Tel: 07443759912,No ratings yet Rate it yourself - /Services/careproviders/LeaveReview/DefaultView.aspx?id=1-12082815020,0,0,,
ELY DIOCESAN ASSOCIATION FOR DEAF PEOPLE (Cambridgeshire Deaf Association),1-6957380789,SCL,Saxongate Lilac Office,"1st Floor, High Street",,Huntingdon,,PE29 3RR,Tel: 01223246237,No ratings yet Rate it yourself - /Services/careproviders/LeaveReview/DefaultView.aspx?id=1-6957380789,0,0,,
Hunters Down Care Home,1-126007077,SCL,Hartford Road,,,Huntingdon,Cambridgeshire,PE29 1XL,Tel: 01480456899,No ratings yet Rate it yourself - /Services/careproviders/LeaveReview/DefaultView.aspx?id=1-126007077,0,0,,
Willow Care and Support Group,1-14246096632,SCL,Castle Hill House,High Street,,Huntingdon,Cambridgeshire,PE29 3TE,Tel: 01408400700,No ratings yet Rate it yourself - /Services/careproviders/LeaveReview/DefaultView.aspx?id=1-14246096632,0,0,,
Availl (Huntingdon),1-4949256584,SCL,Castle Hill House,20 High Street,,Huntingdon,,PE29 3TE,Tel: 01480587758,No ratings yet Rate it yourself - /Services/careproviders/LeaveReview/DefaultView.aspx?id=1-4949256584,0,0,,
Faith Care Line Services Ltd,1-4514325131,SCL,Castle Hill House,High Street,,Huntingdon,Cambridgeshire,PE29 3TE,Tel: 08007747042,No ratings yet Rate it yourself - /Services/careproviders/LeaveReview/DefaultView.aspx?id=1-4514325131,0,0,,
Rose Cottage Residential Home,1-4866698261,SCL,School Road,Broughton,,Huntingdon,Cambridgeshire,PE28 3AT,Tel: 01487822550,No ratings yet Rate it yourself - /Services/careproviders/LeaveReview/DefaultView.aspx?id=1-4866698261,0,0,,
Hardwick Dene,1-1818524762,SCL,Hardwick Lane,Buckden,,St Neots,Cambridgeshire,PE19 5UN,Tel: 01480811322,No ratings yet Rate it yourself - /Services/careproviders/LeaveReview/DefaultView.aspx?id=1-1818524762,0,0,,
Saxon Manor Care Home,1-17594432918,SCL,Russet Close,Godmanchester,,Huntingdon,,PE29 2FF,Tel: 01480400058,No ratings yet Rate it yourself - /Services/careproviders/LeaveReview/DefaultView.aspx?id=1-17594432918,0,0,,
Oaktrees,1-124681993,SCL,Warboys Road,Oldhurst,,Huntingdon,Cambridgeshire,PE28 3AA,Tel: 01487822878,No ratings yet Rate it yourself - /Services/careproviders/LeaveReview/DefaultView.aspx?id=1-124681993,0,0,,
The Red House Care Home,1-3015755757,SCL,Bury Road,Ramsey,,Huntingdon,Cambridgeshire,PE26 1NA,Tel: 01487813936,1 rating Rate it yourself - /Services/careproviders/LeaveReview/DefaultView.aspx?id=1-3015755757,,,,
Florence House Residential Home,1-106682439,SCL,Westfield Road,Ramsey,,Huntingdon,Cambridgeshire,PE26 1JR,,No ratings yet Rate it yourself - /Services/careproviders/LeaveReview/DefaultView.aspx?id=1-106682439,0,0,,
Triple Home Care Ltd,1-451724451,SCL,7 Primrose Close,"Ramsey St. Marys, Ramsey",,Huntingdon,,PE26 2UT,Tel: 07526711221,No ratings yet Rate it yourself - /Services/careproviders/LeaveReview/DefaultView.aspx?id=1-451724451,0,0,,
Girassol Community Care (Huntingdonshire),1-10060134085,SCL,24 C Great Whyte,Ramsey,,Huntingdon,,PE26 1HA,Tel: 01487812098,1 rating Rate it yourself - /Services/careproviders/LeaveReview/DefaultView.aspx?id=1-10060134085,,,,
Radis Community Care (Eden Place ECH),1-3230987795,SCL,Langley Close,,,St Ives,Cambridgeshire,PE27 6ST,Tel: 01480465758,No ratings yet Rate it yourself - /Services/careproviders/LeaveReview/DefaultView.aspx?id=1-3230987795,0,0,,
Astar1 Care Agency Limited,1-14716644165,SCL,24 Mallory Drive,Yaxley,,Peterborough,,PE7 3AF,Tel: 07473446537,No ratings yet Rate it yourself - /Services/careproviders/LeaveReview/DefaultView.aspx?id=1-14716644165,0,0,,
Olivemede,1-116788721,SCL,Hawthorne Road,Yaxley,,Peterborough,Cambridgeshire,PE7 3JP,Tel: 01733240972,No ratings yet Rate it yourself - /Services/careproviders/LeaveReview/DefaultView.aspx?id=1-116788721,0,0,,
Rheola Care Home,1-125657707,SCL,Broad Leas,,,St Ives,Cambridgeshire,PE27 5PU,Tel: 01480375163,No ratings yet Rate it yourself - /Services/careproviders/LeaveReview/DefaultView.aspx?id=1-125657707,0,0,,
Bloomsbury Home Care - Cambridgeshire,1-9674623455,SCL,12 Manor Mews,Bridge Street,,St. Ives,,PE27 5UW,Tel: 01223625031,No ratings yet Rate it yourself - /Services/careproviders/LeaveReview/DefaultView.aspx?id=1-9674623455,0,0,,
Field Lodge,1-1190770444,SCL,London Road,,,St Ives,Cambridgeshire,PE27 5EX,Tel: 01480499840,No ratings yet Rate it yourself - /Services/careproviders/LeaveReview/DefaultView.aspx?id=1-1190770444,0,0,,
Polebrook Nursing Home,1-4201736311,SCL,Morgans Close,Polebrook,,Peterborough,Cambridgeshire,PE8 5LU,Tel: 01832273256,No ratings yet Rate it yourself - /Services/careproviders/LeaveReview/DefaultView.aspx?id=1-4201736311,0,0,,
Caring Together,1-139853361,SCL,L D H House,Parsons Green,,St. Ives,,PE27 4AA,Tel: 03452410954,No ratings yet Rate it yourself - /Services/careproviders/LeaveReview/DefaultView.aspx?id=1-139853361,0,0,,
Greenhill (Hampton Water),1-15259122565,SCL,62 Tilgate Road,Hampton Water,,Peterborough,,PE7 8QT,Tel: 01733639185,No ratings yet Rate it yourself - /Services/careproviders/LeaveReview/DefaultView.aspx?id=1-15259122565,0,0,,
Conquest House,1-128531931,SCL,Straight Drove,Farcet,,Peterborough,Cambridgeshire,PE7 3DJ,Tel: 01733244623,No ratings yet Rate it yourself - /Services/careproviders/LeaveReview/DefaultView.aspx?id=1-128531931,0,0,,
Hampton Grove Care Home,1-135491235,SCL,Chaffinch Lane,Hampton Vale,,Peterborough,Cambridgeshire,PE7 8NF,Tel: 01733246840,2 ratings Rate it yourself - /Services/careproviders/LeaveReview/DefaultView.aspx?id=1-135491235,,,,
Paxigate Healthcare Limited,1-10813644151,SCL,Unit CB3,"The Conservatory Village, Little Paxton",,St. Neots,,PE19 6EN,Tel: 01480731211,No ratings yet Rate it yourself - /Services/careproviders/LeaveReview/DefaultView.aspx?id=1-10813644151,0,0,,
Paxton Hall Care Home,1-110229723,SCL,Rampley Lane,Little Paxton,,St Neots,Cambridgeshire,PE19 6NY,Tel: 01480213036,No ratings yet Rate it yourself - /Services/careproviders/LeaveReview/DefaultView.aspx?id=1-110229723,0,0,,
Clayburn Court,1-2159114994,SCL,Clayburn Road,,,Peterborough,Cambridgeshire,PE7 8LB,Tel: 03001237235,No ratings yet Rate it yourself - /Services/careproviders/LeaveReview/DefaultView.aspx?id=1-2159114994,0,0,,
Haddon House,1-5383923282,SCL,Brickburn Close,Hampton Centre,,Peterborough,Cambridgeshire,PE7 8NZ,Tel: 01733246444,No ratings yet Rate it yourself - /Services/careproviders/LeaveReview/DefaultView.aspx?id=1-5383923282,0,0,,
St Edmunds Court,1-10853709394,SCL,St. Edmunds Court,St. Edmunds Walk,,Peterborough,,PE7 8NA,Tel: 01733229416,No ratings yet Rate it yourself - /Services/careproviders/LeaveReview/DefaultView.aspx?id=1-10853709394,0,0,,
An Darach Care - Cambridgeshire,1-7900244373,SCL,2 Peterborough Road,Farcet,,Peterborough,,PE7 3BH,Tel: 01733241722,No ratings yet Rate it yourself - /Services/careproviders/LeaveReview/DefaultView.aspx?id=1-7900244373,0,0,,
Multi - Care Community Services Ltd,1-1354075301,SCL,7 Rookery Place,Fenstanton,,Huntingdon,,PE28 9LZ,Tel: 01480466387,No ratings yet Rate it yourself - /Services/careproviders/LeaveReview/DefaultView.aspx?id=1-1354075301,0,0,,
Calmsa Healthcare Ltd,1-16860883586,SCL,29 Brudenell,Orton Goldhay,,Peterborough,,PE2 5SX,Tel: 07816835535,No ratings yet Rate it yourself - /Services/careproviders/LeaveReview/DefaultView.aspx?id=1-16860883586,0,0,,
We Care Nursing Services,1-13207004124,SCL,"Milnyard Business Centre, 1 Milnyard Square",Orton Southgate,,Peterborough,,PE2 6GX,Tel: 07496019584,No ratings yet Rate it yourself - /Services/careproviders/LeaveReview/DefaultView.aspx?id=1-13207004124,0,0,,
Starry Care Peterborough,1-13868712169,SCL,1 Milnyard Square,Orton Southgate,,Peterborough,,PE2 6GX,Tel: 07880315539,No ratings yet Rate it yourself - /Services/careproviders/LeaveReview/DefaultView.aspx?id=1-13868712169,0,0,,
Christine Marie Care - Peterborough,1-15645968962,SCL,1 Milnyard Square,Orton Southgate,,Peterborough,,PE2 6GX,Tel: 01223751362,No ratings yet Rate it yourself - /Services/careproviders/LeaveReview/DefaultView.aspx?id=1-15645968962,0,0,,
Pure Hearts Care Services,1-14538686336,SCL,1 Milnyard Square,Orton Southgate,,Peterborough,,PE2 6GX,Tel: 01733301985,No ratings yet Rate it yourself - /Services/careproviders/LeaveReview/DefaultView.aspx?id=1-14538686336,0,0,,
Sense - Supported Living Services (East),1-4135553371,SCL,50 Forder Way,"Cygnet Park, Hampton",,Peterborough,Cambridgeshire,PE7 8JB,Tel: 01733425073,No ratings yet Rate it yourself - /Services/careproviders/LeaveReview/DefaultView.aspx?id=1-4135553371,0,0,,
Madheka Care,1-9888615872,SCL,37 Buckthorn Road,Hampton Hargate,,Peterborough,,PE7 8EE,Tel: 07473919909,No ratings yet Rate it yourself - /Services/careproviders/LeaveReview/DefaultView.aspx?id=1-9888615872,0,0,,
Bluebird Care Peterborough & Oundle,1-12451122150,SCL,"2a, Cyrus Way","Cygnet Park, Hampton",,Peterborough,,PE7 8HP,Tel: 01733459907,No ratings yet Rate it yourself - /Services/careproviders/LeaveReview/DefaultView.aspx?id=1-12451122150,0,0,,
"Home Instead Senior Care - Peterborough, Oundle & The Deepings",1-1127939767,SCL,"Unit 1, Swan Court","Cygnet Park, Hampton",,Peterborough,Cambridgeshire,PE7 8GX,Tel: 01733333342,No ratings yet Rate it yourself - /Services/careproviders/LeaveReview/DefaultView.aspx?id=1-1127939767,0,0,,
Humane Care Services Limited,1-12136883014,SCL,22 Flora Close,,,Peterborough,,PE2 8GY,,No ratings yet Rate it yourself - /Services/careproviders/LeaveReview/DefaultView.aspx?id=1-12136883014,0,0,,
Regional Care Peterborough,1-2964096482,SCL,"Unit 4, Orton Enterprise Centre",Bakewell Road,,Peterborough,,PE2 6XU,Tel: 01733838380,2 ratings Rate it yourself - /Services/careproviders/LeaveReview/DefaultView.aspx?id=1-2964096482,,,,
Meadows Homecare Services,1-1794098724,SCL,"Unit 9, Orton Enterprise Centre","Bakewell Road, Orton Southgate",,Peterborough,,PE2 6XU,Tel: 01733 889440,No ratings yet Rate it yourself - /Services/careproviders/LeaveReview/DefaultView.aspx?id=1-1794098724,0,0,,
4passioncare,1-2748194119,SCL,"Unit 20, Orton Enterprise Centre",Bakewell Road,,Peterborough,,PE2 6XU,Tel: 01733686063,No ratings yet Rate it yourself - /Services/careproviders/LeaveReview/DefaultView.aspx?id=1-2748194119,0,0,,
The Maples,1-2146554008,SCL,Goldhay Way,Orton Goldhay,,Peterborough,Cambridgeshire,PE2 5SF,Tel: 01733370022,No ratings yet Rate it yourself - /Services/careproviders/LeaveReview/DefaultView.aspx?id=1-2146554008,0,0,,
BH CARE SERVICES LTD,1-16876249297,SCL,9 Hudson Grove,,,Peterborough,,PE7 0LT,Tel: 01733739204,No ratings yet Rate it yourself - /Services/careproviders/LeaveReview/DefaultView.aspx?id=1-16876249297,0,0,,
Brookfield,1-136683093,SCL,1 High Street,Somersham,,Huntingdon,Cambridgeshire,PE28 3JA,Tel: 01487 840900,1 rating Rate it yourself - /Services/careproviders/LeaveReview/DefaultView.aspx?id=1-136683093,,,,
Enlightenment Care Services Ltd,1-7600863554,SCL,"Oundle Wharf, Unit 2","Station Road, Oundle",,Peterborough,,PE8 4DE,Tel: 07548864298,No ratings yet Rate it yourself - /Services/careproviders/LeaveReview/DefaultView.aspx?id=1-7600863554,0,0,,
Tecmak care Ltd,1-17130310033,SCL,54 Saxonbury Way,,,Peterborough,,PE2 9FB,Tel: 07954851344,No ratings yet Rate it yourself - /Services/careproviders/LeaveReview/DefaultView.aspx?id=1-17130310033,0,0,,
Longueville Court,1-125856362,SCL,Village Green,Orton Longueville,,Peterborough,Cambridgeshire,PE2 7DN,Tel: 01733230709,2 ratings Rate it yourself - /Services/careproviders/LeaveReview/DefaultView.aspx?id=1-125856362,,,,
Royal Mencap Society - 32 Kings Lane,1-119177038,SCL,Popewalk House,"32 Kings Lane, St Neots",,Huntingdon,Cambridgeshire,PE19 1LB,Tel: 01480214928,No ratings yet Rate it yourself - /Services/careproviders/LeaveReview/DefaultView.aspx?id=1-119177038,0,0,,
Lapwing Court,1-4262344024,SCL,"Managers Office, Lapwing Court","Matley, Orton Brimbles",,Peterborough,Cambridgeshire,PE2 5YR,Tel: 07388991324,No ratings yet Rate it yourself - /Services/careproviders/LeaveReview/DefaultView.aspx?id=1-4262344024,0,0,,
Infinitelife Peterborough,1-15876885182,SCL,1 Belton Road,Park Farm Stanground,,Peterborough,,PE2 8UU,Tel: 03301138884,No ratings yet Rate it yourself - /Services/careproviders/LeaveReview/DefaultView.aspx?id=1-15876885182,0,0,,
Abbott House - Oundle,1-133856208,SCL,Glapthorn Road,,,Oundle,Northamptonshire,PE8 4JA,Tel: 01832277650,No ratings yet Rate it yourself - /Services/careproviders/LeaveReview/DefaultView.aspx?id=1-133856208,0,0,,
St Margaret's House,1-127088237,SCL,187 London Road,London Road,,Peterborough,Cambridgeshire,PE2 9DS,Tel: 01733555008,No ratings yet Rate it yourself - /Services/careproviders/LeaveReview/DefaultView.aspx?id=1-127088237,0,0,,
A Class Care,1-2306659186,SCL,Upper Pendrill Court,"Ermine Street North, Papworth Everard",,Cambridge,Cambridgeshire,CB23 3UY,Tel: 01223864066,No ratings yet Rate it yourself - /Services/careproviders/LeaveReview/DefaultView.aspx?id=1-2306659186,0,0,,
Henbrook House,1-19026099050,SCL,Cambridge Street,,,St. Neots,,PE19 1QB,Tel: 01480275020,No ratings yet Rate it yourself - /Services/careproviders/LeaveReview/DefaultView.aspx?id=1-19026099050,0,0,,
East Office,1-5714589068,SCL,27 Commerce Road,Lynch Wood,,Peterborough,,PE2 6LR,Tel: 01733367250,No ratings yet Rate it yourself - /Services/careproviders/LeaveReview/DefaultView.aspx?id=1-5714589068,0,0,,
Next Steps Community Care LTD,1-2023491521,SCL,"8 Tesla Court, Innovation Way",Lynch Wood,,Peterborough,Cambridgeshire,PE2 6FL,Tel: 01733391212,No ratings yet Rate it yourself - /Services/careproviders/LeaveReview/DefaultView.aspx?id=1-2023491521,0,0,,
Cera - Peterborough,1-138948798,SCL,"Unit 18, Telsa Court","Innovation Way, Lynch Wood",,Peterborough,,PE2 6FL,Tel: 01733834774,No ratings yet Rate it yourself - /Services/careproviders/LeaveReview/DefaultView.aspx?id=1-138948798,0,0,,
Caring Crew Limited,1-6226799671,SCL,"Unit 30a, Tesla Court","Innovation Way, Lynch Wood",,Peterborough,,PE2 6FL,Tel: 01733264113,1 rating Rate it yourself - /Services/careproviders/LeaveReview/DefaultView.aspx?id=1-6226799671,,,,
The Old Vicarage Care Home,1-4543416587,SCL,27 Church Street,,,St Neots,Cambridgeshire,PE19 2BU,Tel: 01480476789,No ratings yet Rate it yourself - /Services/careproviders/LeaveReview/DefaultView.aspx?id=1-4543416587,0,0,,
The Hub,1-4303128167,SCL,Unit 33,"Aston Business Park, Shrewsbury Avenue",,Peterborough,Cambridgeshire,PE2 7BF,Tel: 01733234828,No ratings yet Rate it yourself - /Services/careproviders/LeaveReview/DefaultView.aspx?id=1-4303128167,0,0,,
HF Trust - Corunna Close,1-2328677756,SCL,1 Corunna Close,Eaton Ford,,St Neots,Cambridgeshire,PE19 7NE,Tel: 01480471937,No ratings yet Rate it yourself - /Services/careproviders/LeaveReview/DefaultView.aspx?id=1-2328677756,0,0,,
Care Reserve Peterborough,1-7208006571,SCL,"Workspace House, Unit 28-29",Maxwell Road,,Peterborough,,PE2 7JE,Tel: 01733396164,No ratings yet Rate it yourself - /Services/careproviders/LeaveReview/DefaultView.aspx?id=1-7208006571,0,0,,
Quality Care Services Peterborough,1-9219470705,SCL,Unit 10,"Workspace House Unit 28-29, Maxwell Road",,Peterborough,,PE2 7JE,,No ratings yet Rate it yourself - /Services/careproviders/LeaveReview/DefaultView.aspx?id=1-9219470705,0,0,,
Focus Care Supported Living Ltd,1-456567055,SCL,"Unit 13, The Metro Centre",,,Peterborough,Cambridgeshire,PE2 7UH,Tel: 01733261233,1 rating Rate it yourself - /Services/careproviders/LeaveReview/DefaultView.aspx?id=1-456567055,,,,
Gella Care Services Ltd,1-6721627012,SCL,8 Eaton Ford Green,Eaton Ford,,St. Neots,,PE19 7AF,Tel: 07564303108,No ratings yet Rate it yourself - /Services/careproviders/LeaveReview/DefaultView.aspx?id=1-6721627012,0,0,,
Kingfisher Court,1-2240256494,SCL,Kingfisher Court,Thistle Drive,,Peterborough,Cambridgeshire,PE2 8NZ,Tel: 01733396484,No ratings yet Rate it yourself - /Services/careproviders/LeaveReview/DefaultView.aspx?id=1-2240256494,0,0,,
Kingfisher Domicillary Care,1-2492828527,SCL,Kingfisher Court,Thistle Drive,,Peterborough,Cambridgeshire,PE2 8NZ,Tel: 01733396484,No ratings yet Rate it yourself - /Services/careproviders/LeaveReview/DefaultView.aspx?id=1-2492828527,0,0,,
Ford House,1-152907348,SCL,140 St Neots Road,Eaton Ford,,St Neots,Cambridgeshire,PE19 7AL,Tel: 01480472017,No ratings yet Rate it yourself - /Services/careproviders/LeaveReview/DefaultView.aspx?id=1-152907348,0,0,,
Emerge Healthacare Services Limited,1-18047068887,SCL,20 Wagtail Way,Thrapston,,Kettering,,NN14 4GQ,Tel: 07429986334,No ratings yet Rate it yourself - /Services/careproviders/LeaveReview/DefaultView.aspx?id=1-18047068887,0,0,,
Wellness Care Provider,1-18039161205,SCL,1st Floor,Lynch Wood Business Park,,Peterborough,,PE2 6FY,Tel: 07449836212,No ratings yet Rate it yourself - /Services/careproviders/LeaveReview/DefaultView.aspx?id=1-18039161205,0,0,,
Integrative Care,1-16142879356,SCL,"1st Floor, Lynch Wood Business Park",,,Peterborough,,PE2 6FY,Tel: 077422617265,No ratings yet Rate it yourself - /Services/careproviders/LeaveReview/DefaultView.aspx?id=1-16142879356,0,0,,