Organisation Name,NACS Code,Organisation Type,Address1,Address2,Address3,Address4,Address5,PostCode,Telephone Number,Opening time,Value  (Opening time),Banding Classification  (Opening time),NHS.UK users rating,Value  (NHS.UK users rating),Banding Classification  (NHS.UK users rating),Electronic prescription service,Value  (Electronic prescription service),Banding Classification  (Electronic prescription service),Car parking (Is there car parking at this organisation?)
Boots,FFY65,PHA,25 TOWN MALL WALK,THE ORACLE,READING,BERKSHIRE,,RG1 2AH,Tel: 01189587529, - ,,,3 ratings Rate it yourself - /Services/pharmacies/LeaveReview/DefaultView.aspx?id=FFY65,,,,Yes,yes,yes
Boots,FDT21,PHA,47-48 BROAD STREET,,READING,BERKSHIRE,,RG1 2AE,Tel: 01189571135, - ,,,4 ratings Rate it yourself - /Services/pharmacies/LeaveReview/DefaultView.aspx?id=FDT21,,,,Yes,yes,no
Superdrug Pharmacy,FGX83,PHA,55-59 BROAD STREET,,READING,BERKSHIRE,,RG1 2AF,Tel: 0118 9599772        , - ,,,1 rating Rate it yourself - /Services/pharmacies/LeaveReview/DefaultView.aspx?id=FGX83,,,,Yes,yes,no
Saood Pharmacy,FLK26,PHA,104A OXFORD ROAD,READING, , ,,RG1 7LL,Tel: 0118 957 2687, - ,,,12 ratings Rate it yourself - /Services/pharmacies/LeaveReview/DefaultView.aspx?id=FLK26,,,,Yes,yes,no
MILMAN ROAD PHARMACY,FG814,PHA,MILMAN ROAD HEALTH CENTRE,GROUND FLOOR MILMAN ROAD,READING,BERKSHIRE,,RG2 0AR,Tel: 0118 9864015, - ,,,No ratings yet Rate it yourself - /Services/pharmacies/LeaveReview/DefaultView.aspx?id=FG814,0,0,,Yes,yes,
Newdays Pharmacy,FLR49,PHA,60 WENSLEY ROAD,COLEY PARK,READING,,,RG1 6DJ,Tel: 0118 959 0270, - ,,,4 ratings Rate it yourself - /Services/pharmacies/LeaveReview/DefaultView.aspx?id=FLR49,,,,Yes,yes,yes
Fourways Pharmacy,FDP58,PHA,195 London Road, ,Reading,Berkshire,,RG1 3NX,Tel: 0118 9660541, - ,,,3 ratings Rate it yourself - /Services/pharmacies/LeaveReview/DefaultView.aspx?id=FDP58,,,,Yes,yes,
Christchurch Road Pharmacy,FW067,PHA,68 Christchurch Road, ,Reading,Berkshire,,RG2 7AZ,Tel: 0118 9871868, - ,,,4 ratings Rate it yourself - /Services/pharmacies/LeaveReview/DefaultView.aspx?id=FW067,,,,Yes,yes,
Basingstoke Road Pharmacy,FGD71,PHA,71 BASINGSTOKE ROAD,,READING,BERKSHIRE,,RG2 0ER,Tel: 0118 9875712, - ,,,4 ratings Rate it yourself - /Services/pharmacies/LeaveReview/DefaultView.aspx?id=FGD71,,,,Yes,yes,no
ERLEIGH PHARMACY,FA288,PHA,85-87 ERLEIGH ROAD,,READING,BERKSHIRE,,RG1 5NN,Tel: 0118 9663718, - ,,,12 ratings Rate it yourself - /Services/pharmacies/LeaveReview/DefaultView.aspx?id=FA288,,,,Yes,yes,yes
Boots,FEX35,PHA,45 CHURCH STREET,,CAVERSHAM,READING,,RG4 8BA,Tel: 01189471602, - ,,,No ratings yet Rate it yourself - /Services/pharmacies/LeaveReview/DefaultView.aspx?id=FEX35,0,0,,Yes,yes,no
Western Elms Pharmacy,FMW33,PHA,351-353 OXFORD ROAD,,READING,BERKSHIRE,,RG30 1AY,Tel: 0118 9586502, - ,,,4 ratings Rate it yourself - /Services/pharmacies/LeaveReview/DefaultView.aspx?id=FMW33,,,,Yes,yes,yes
Oxford Road Pharmacy,FQP38,PHA,270-274 OXFORD ROAD,,READING,BERKSHIRE,,RG30 1AD,Tel: 01189 574999, - ,,,24 ratings Rate it yourself - /Services/pharmacies/LeaveReview/DefaultView.aspx?id=FQP38,,,,Yes,yes,
Tesco Instore Pharmacy,FA368,PHA,TESCO EXTRA,PORTMAN ROAD,READING,BERKSHIRE,,RG30 1AH,Tel: 0118 9904803, - ,,,8 ratings Rate it yourself - /Services/pharmacies/LeaveReview/DefaultView.aspx?id=FA368,,,,Yes,yes,yes
CAVERSHAM PHARMACY,FMJ89,PHA,59 HEMDEAN ROAD,CAVERSHAM,READING,BERKSHIRE,,RG4 7SS,Tel: 0118 9471776        , - ,,,13 ratings Rate it yourself - /Services/pharmacies/LeaveReview/DefaultView.aspx?id=FMJ89,,,,Yes,yes,yes
Markand Pharmacy,FA597,PHA,122 Henley Road,Caversham,Nr Reading,Berkshire,,RG4 6DH,Tel: 0118 9472464        , - ,,,14 ratings Rate it yourself - /Services/pharmacies/LeaveReview/DefaultView.aspx?id=FA597,,,,Yes,yes,yes
The Reading Pharmacy,FAE42,PHA,105 WOKINGHAM ROAD,,READING,BERKSHIRE,,RG6 1LN,Tel: 0118 9262034, - ,,,53 ratings Rate it yourself - /Services/pharmacies/LeaveReview/DefaultView.aspx?id=FAE42,,,,Yes,yes,yes
Whitley 277 Pharmacy,FE270,PHA,277 BASINGSTOKE ROAD,,READING,BERKSHIRE,,RG2 0JA,Tel: 0118 9872238, - ,,,5 ratings Rate it yourself - /Services/pharmacies/LeaveReview/DefaultView.aspx?id=FE270,,,,Yes,yes,yes
Grovelands Pharmacy,FQD26,PHA,2 GROVELANDS ROAD,,READING,BERKSHIRE,,RG30 2NY,Tel: 0118 9572389, - ,,,8 ratings Rate it yourself - /Services/pharmacies/LeaveReview/DefaultView.aspx?id=FQD26,,,,Yes,yes,no
SOUTHCOTE PHARMACY,FHF90,PHA,36 CORONATION SQUARE,,READING,BERKSHIRE,,RG30 3QN,Tel: 0118 9575619        , - ,,,29 ratings Rate it yourself - /Services/pharmacies/LeaveReview/DefaultView.aspx?id=FHF90,,,,Yes,yes,yes
Vantage Chemist,FRP45,PHA,231 SHINFIELD ROAD,,READING,BERKSHIRE,,RG2 8HD,Tel: 0118 9872850, - ,,,6 ratings Rate it yourself - /Services/pharmacies/LeaveReview/DefaultView.aspx?id=FRP45,,,,Yes,yes,yes
Boots,FNE16,PHA,5 THE PARADE,"SILVERDALE ROAD, EARLEY",READING,BERKSHIRE,,RG6 7NZ,Tel: 01189262146, - ,,,5 ratings Rate it yourself - /Services/pharmacies/LeaveReview/DefaultView.aspx?id=FNE16,,,,Yes,yes,yes
ASDA PHARMACY,FT293,PHA,HONEY END LANE,,READING,BERKSHIRE,,RG30 4EL,Tel: 0118 951 4710, - ,,,No ratings yet Rate it yourself - /Services/pharmacies/LeaveReview/DefaultView.aspx?id=FT293,0,0,,Yes,yes,yes
MEDWAY PHARMACY,FFX18,PHA,32 MEADWAY PRECINCT,TILEHURST,READING, ,,RG30 4AA,Tel: 0118 9580477, - ,,,1 rating Rate it yourself - /Services/pharmacies/LeaveReview/DefaultView.aspx?id=FFX18,,,,Yes,yes,
EMMER GREEN PHARMACY,FPX62,PHA,5 CAVENDISH ROAD,CAVERSHAM PARK,READING,BERKSHIRE,,RG4 8XU,Tel: 0118 9479443, - ,,,1 rating Rate it yourself - /Services/pharmacies/LeaveReview/DefaultView.aspx?id=FPX62,,,,Yes,yes,
Whitley Wood Pharmacy,FLG15,PHA,534 NORTHUMBERLAND AVENUE,,READING,BERKSHIRE,,RG2 8NY,Tel: 0118 9872023, - ,,,8 ratings Rate it yourself - /Services/pharmacies/LeaveReview/DefaultView.aspx?id=FLG15,,,,Yes,yes,yes
Boots,FY485,PHA,"UNIT 2,ASDA MALL",LOWER EARLEY DISTRICT CTR,LOWER EARLEY,"READING,BERKSHIRE",,RG6 5GA,Tel: 01189311750, - ,,,6 ratings Rate it yourself - /Services/pharmacies/LeaveReview/DefaultView.aspx?id=FY485,,,,Yes,yes,yes
ASDA PHARMACY,FA448,PHA,Chalfont Way,Lower Earley,Reading,Berkshire,,RG6 5TT,Tel: 0118 9870310, - ,,,4 ratings Rate it yourself - /Services/pharmacies/LeaveReview/DefaultView.aspx?id=FA448,,,,Yes,yes,yes
POTTERY ROAD PHARMACY,FVF36,PHA,2A TYLERS PLACE,"POTTERY ROAD, TILEHURST",READING,BERKSHIRE,,RG30 6BW,Tel: 0118 9451063, - ,,,No ratings yet Rate it yourself - /Services/pharmacies/LeaveReview/DefaultView.aspx?id=FVF36,0,0,,Yes,yes,
Boots,FLD94,PHA,89-91 CROCKHAMWELL ROAD,WOODLEY,READING, ,,RG5 3JP,Tel: 01189695253, - ,,,4 ratings Rate it yourself - /Services/pharmacies/LeaveReview/DefaultView.aspx?id=FLD94,,,,Yes,yes,no
DAY LEWIS PHARMACY,FHJ96,PHA,15 MAIDEN LANE CENTRE,LOWER EARLEY,READING, ,,RG6 3HD,Tel: 01189351848, - ,,,4 ratings Rate it yourself - /Services/pharmacies/LeaveReview/DefaultView.aspx?id=FHJ96,,,,Yes,yes,no
Tilehurst Pharmacy,FGF17,PHA,7 SCHOOL ROAD,TILEHURST,READING,BERKSHIRE,,RG31 5AR,Tel: 0118 9427353, - ,,,8 ratings Rate it yourself - /Services/pharmacies/LeaveReview/DefaultView.aspx?id=FGF17,,,,Yes,yes,yes
TRIANGLE PHARMACY,FDX71,PHA,88-90 SCHOOL ROAD,TILEHURST,READING,BERKSHIRE,,RG31 5AW,Tel: 0118 9427523, - ,,,9 ratings Rate it yourself - /Services/pharmacies/LeaveReview/DefaultView.aspx?id=FDX71,,,,Yes,yes,yes
Shinfield Pharmacy,FA593,PHA,SHINFIELD PRIM. CARE CTR,SCHOOL GREEN,SHINFIELD,BERKSHIRE,,RG2 9EH,Tel: 0118 9883540, - ,,,10 ratings Rate it yourself - /Services/pharmacies/LeaveReview/DefaultView.aspx?id=FA593,,,,Yes,yes,yes
DAY LEWIS PHARMACY,FPA84,PHA,1-2 LODDON VALE CENTRE,"HURRICANE WAY, WOODLEY",READING,BERKSHIRE,,RG5 4UX,Tel: 01189441036, - ,,,3 ratings Rate it yourself - /Services/pharmacies/LeaveReview/DefaultView.aspx?id=FPA84,,,,Yes,yes,yes
Overdown Pharmacy,FM678,PHA,5 THE COLONNADE,"OVERDOWN ROAD, TILEHURST",READING,BERKSHIRE,,RG31 6PR,Tel: 0118 9428990, - ,,,9 ratings Rate it yourself - /Services/pharmacies/LeaveReview/DefaultView.aspx?id=FM678,,,,Yes,yes,yes
DAY LEWIS PHARMACY,FG634,PHA,"WELFORD HOUSE, B/STOKE RD",SPENCERS WOOD,READING,BERKSHIRE,,RG7 1AA,Tel: 01189882882, - ,,,3 ratings Rate it yourself - /Services/pharmacies/LeaveReview/DefaultView.aspx?id=FG634,,,,Yes,yes,yes
DAY LEWIS PHARMACY,FG705,PHA,19B WOOD LANE,SONNING COMMON,READING,BERKSHIRE,,RG4 9SJ,Tel: 01189722306, - ,,,No ratings yet Rate it yourself - /Services/pharmacies/LeaveReview/DefaultView.aspx?id=FG705,0,0,,Yes,yes,yes
Newdays Pharmacy,FKE74,PHA,1 LONDON ROAD,TWYFORD,READING,,,RG10 9EH,Tel: 0118 934 5750, - ,,,2 ratings Rate it yourself - /Services/pharmacies/LeaveReview/DefaultView.aspx?id=FKE74,,,,Yes,yes,yes
Kamsons Pharmacy,FMP97,PHA,27 High Street,Theale,Reading,Berkshire,,RG7 5AH,Tel: 0118 9302542, - ,,,No ratings yet Rate it yourself - /Services/pharmacies/LeaveReview/DefaultView.aspx?id=FMP97,0,0,,Yes,yes,yes
Day Lewis Pharmacy,FTX84,PHA,19 LONDON ROAD,TWYFORD,READING,BERKSHIRE,,RG10 9EH,Tel: 01189345519, - ,,,No ratings yet Rate it yourself - /Services/pharmacies/LeaveReview/DefaultView.aspx?id=FTX84,0,0,,Yes,yes,no
FIELDS PHARMACY,FW845,PHA,1A LONGFIELD ROAD,TWYFORD,READING,BERKSHIRE,,RG10 9AN,Tel: 0118 9341222, - ,,,1 rating Rate it yourself - /Services/pharmacies/LeaveReview/DefaultView.aspx?id=FW845,,,,Yes,yes,
Burghfield Pharmacy,FFT63,PHA,Reading Road,Burghfield Common,Reading,Berkshire,,RG7 3YJ,Tel: 0118 9831145, - ,,,5 ratings Rate it yourself - /Services/pharmacies/LeaveReview/DefaultView.aspx?id=FFT63,,,,Yes,yes,yes
PANGBOURNE PHARMACY,FQF63,PHA,3 THE SQUARE,,PANGBOURNE,BERKSHIRE,,RG8 7AQ,Tel: 0118 9842935, - ,,,2 ratings Rate it yourself - /Services/pharmacies/LeaveReview/DefaultView.aspx?id=FQF63,,,,Yes,yes,
Morrisons Pharmacy,FGV18,PHA,WOOSEHILL COURT, ,WORKINGHAM,BERKSHIRE,,RG41 3SW,Tel: 0118 9794288, - ,,,3 ratings Rate it yourself - /Services/pharmacies/LeaveReview/DefaultView.aspx?id=FGV18,,,,Yes,yes,yes
WARGRAVE PHARMACY,FJV05,PHA,48 VICTORIA ROAD,WARGRAVE,READING,BERKSHIRE,,RG10 8AE,Tel: 0118 9403557, - ,,,1 rating Rate it yourself - /Services/pharmacies/LeaveReview/DefaultView.aspx?id=FJV05,,,,Yes,yes,
TESCO INSTORE PHARMACY,FC447,PHA,TESCO STORE,359 READING ROAD,HENLEY-ON-THAMES,OXFORDSHIRE,,RG9 4HA,Tel: 0345 6779343, - ,,,1 rating Rate it yourself - /Services/pharmacies/LeaveReview/DefaultView.aspx?id=FC447,,,,Yes,yes,yes
Wokingham Pharmacy,FT446,PHA,33 BROAD STREET,,WOKINGHAM,BERKSHIRE,,RG40 1AU,Tel: 0118 9787459, - ,,,9 ratings Rate it yourself - /Services/pharmacies/LeaveReview/DefaultView.aspx?id=FT446,,,,Yes,yes,yes
Boots,FMQ41,PHA,40 MARKET PLACE,WOKINGHAM,BERKSHIRE,,,RG40 1AT,Tel: 01189784294, - ,,,5 ratings Rate it yourself - /Services/pharmacies/LeaveReview/DefaultView.aspx?id=FMQ41,,,,Yes,yes,no
TESCO INSTORE PHARMACY,FF045,PHA,78 FINCHAMPSTEAD ROAD, ,WOKINGHAM,BERKSHIRE,,RG40 2NS,Tel: 0118 990 4800, - ,,,5 ratings Rate it yourself - /Services/pharmacies/LeaveReview/DefaultView.aspx?id=FF045,,,,Yes,yes,yes
Rose Street Pharmacy,FNC80,PHA,WOKINGHAM MEDICAL CENTRE,23 ROSE STREET,WOKINGHAM,BERKSHIRE,,RG40 1XS,Tel: 0118 9078188, - ,,,19 ratings Rate it yourself - /Services/pharmacies/LeaveReview/DefaultView.aspx?id=FNC80,,,,Yes,yes,yes
Boots,FHD46,PHA,5/7 BELL STREET,HENLEY ON THAMES,OXFORDSHIRE, ,,RG9 2BA,Tel: 01491574132, - ,,,No ratings yet Rate it yourself - /Services/pharmacies/LeaveReview/DefaultView.aspx?id=FHD46,0,0,,Yes,yes,no
Henley Pharmacy,FTP76,PHA,25 BELL STREET,HENLEY-ON-THAMES,OXFORDSHIRE, ,,RG9 2BA,Tel: 01491 574142, - ,,,4 ratings Rate it yourself - /Services/pharmacies/LeaveReview/DefaultView.aspx?id=FTP76,,,,Yes,yes,yes
THE LITTLE VILLAGE PHARMACY,FD722,PHA,24 WEST END ROAD,MORTIMER,READING,BERKSHIRE,,RG7 3TF,Tel: 0118 9574999, - ,,,1 rating Rate it yourself - /Services/pharmacies/LeaveReview/DefaultView.aspx?id=FD722,,,,Yes,yes,
Mortimer Pharmacy,FLP66,PHA,72 Victoria Road,Mortimer,Reading,Berkshire,,RG7 3SQ,Tel: 01189 333161, - ,,,44 ratings Rate it yourself - /Services/pharmacies/LeaveReview/DefaultView.aspx?id=FLP66,,,,Yes,yes,yes
Jats Pharmacy,FQ649,PHA,422A FINCHAMPSTEAD ROAD,FINCHAMPSTEAD,NR WOKINGHAM,BERKSHIRE,,RG40 3RB,Tel: 0118 973 5455, - ,,,19 ratings Rate it yourself - /Services/pharmacies/LeaveReview/DefaultView.aspx?id=FQ649,,,,Yes,yes,yes
DAY LEWIS PHARMACY,FL267,PHA,FINCHAMPSTEAD SURGERY,474-478 FINCHAMPSTEAD RD,"FINCHAMPSTEAD, WORKINGTON",BERKSHIRE,,RG40 3RG,Tel: 0118 9737084, - ,,,23 ratings Rate it yourself - /Services/pharmacies/LeaveReview/DefaultView.aspx?id=FL267,,,,Yes,yes,Data not available
BINFIELD VILLAGE PHARMACY,FG094,PHA,TERRACE ROAD NORTH,BINFIELD,BRACKNELL,BERKSHIRE,,RG42 5HR,Tel: 01344 868486, - ,,,2 ratings Rate it yourself - /Services/pharmacies/LeaveReview/DefaultView.aspx?id=FG094,,,,Yes,yes,
DUKES PHARMACY,FWC78,PHA,196 DUKES RIDE,CROWTHORNE,BERKSHIRE,,,RG45 6DS,Tel: 01344 776622        , - ,,,25 ratings Rate it yourself - /Services/pharmacies/LeaveReview/DefaultView.aspx?id=FWC78,,,,Yes,yes,yes
GORING PHARMACY,FAA59,PHA,HIGH STREET,GORING-ON-THAMES,READING,BERKSHIRE,,RG8 9AT,Tel: 01491 872124, - ,,,1 rating Rate it yourself - /Services/pharmacies/LeaveReview/DefaultView.aspx?id=FAA59,,,,Yes,yes,
Priestwood Pharmacy,FN569,PHA,7 PRIESTWOOD SQUARE,WINDLESHAM ROAD,BRACKNELL,BERKSHIRE,,RG42 1UD,Tel: 01344 306355, - ,,,6 ratings Rate it yourself - /Services/pharmacies/LeaveReview/DefaultView.aspx?id=FN569,,,,Yes,yes,yes
GREAT HOLLANDS PHARMACY,FA348,PHA,6 GREAT HOLLANDS SQUARE,GREAT HOLLANDS,BRACKNELL,BERKSHIRE,,RG12 8UX,Tel: 01344 420293, - ,,,No ratings yet Rate it yourself - /Services/pharmacies/LeaveReview/DefaultView.aspx?id=FA348,0,0,,Yes,yes,
Boots,FP147,PHA,UNIT 1 TRESHAM CRESCENT,MONTEAGLE LANE,YATELEY,HAMPSHIRE,,GU46 6FR,Tel: 01252860508, - ,,,2 ratings Rate it yourself - /Services/pharmacies/LeaveReview/DefaultView.aspx?id=FP147,,,,Yes,yes,yes
Woodland Park Pharmacy,FA433,PHA,Waltham Road,Woodland Park,Maidenhead,Berkshire,,SL6 3NH,Tel: 01628 822891, - ,,,2 ratings Rate it yourself - /Services/pharmacies/LeaveReview/DefaultView.aspx?id=FA433,,,,Yes,yes,yes
SKYLIGHT PHARMACY,FMW34,PHA,"UNIT 1, MANHATTAN HOUSE",140 HIGH STREET,CROWTHORNE,BERKSHIRE,,RG45 7AY,Tel: 01344 772432, - ,,,1 rating Rate it yourself - /Services/pharmacies/LeaveReview/DefaultView.aspx?id=FMW34,,,,Yes,yes,
H A MCPARLAND LTD,FKY97,PHA,182 HIGH STREET,CROWTHORNE,BERKSHIRE,,,RG45 7AP,Tel: 01344 779007, - ,,,No ratings yet Rate it yourself - /Services/pharmacies/LeaveReview/DefaultView.aspx?id=FKY97,0,0,,Yes,yes,yes
Boots,FMR86,PHA,1 HARPTON PARADE,YATELEY,HAMPSHIRE, ,,GU46 7SB,Tel: 01252874577, - ,,,3 ratings Rate it yourself - /Services/pharmacies/LeaveReview/DefaultView.aspx?id=FMR86,,,,Yes,yes,yes
YATELEY PHARMACY,FGN78,PHA,111 READING ROAD,,YATELEY,HAMPSHIRE,,GU46 7LR,Tel: 01252 873518, - ,,,No ratings yet Rate it yourself - /Services/pharmacies/LeaveReview/DefaultView.aspx?id=FGN78,0,0,,Yes,yes,
EASTHAMPSTEAD PHARMACY,FG880,PHA,8 RECTORY ROW,EASTHAMPSTEAD,BRACKNELL,BERKSHIRE,,RG12 7BN,Tel: 01344 421755, - ,,,No ratings yet Rate it yourself - /Services/pharmacies/LeaveReview/DefaultView.aspx?id=FG880,0,0,,Yes,yes,
Boots,FEK22,PHA,THE LEXICON SHOPPING CTR,19-23 BRACCAN WALK,BRACKNELL,BERKSHIRE,,RG12 1BE,Tel: 01344303844, - ,,,2 ratings Rate it yourself - /Services/pharmacies/LeaveReview/DefaultView.aspx?id=FEK22,,,,Yes,yes,yes
Superdrug Pharmacy,FA677,PHA,Unit d,13 Charles Square,Bracknell,Berkshire,,RG12 1DF,Tel: 01344 303720, - ,,,1 rating Rate it yourself - /Services/pharmacies/LeaveReview/DefaultView.aspx?id=FA677,,,,Yes,yes,yes
Wessex Pharmacy,FPT01,PHA,114 WESSEX WAY,COX GREEN,MAIDENHEAD,BERKSHIRE,,SL6 3DL,Tel: 01628631384, - ,,,2 ratings Rate it yourself - /Services/pharmacies/LeaveReview/DefaultView.aspx?id=FPT01,,,,Yes,yes,yes
Holmwood Pharmacy,FVJ17,PHA,FRANKLIN AVENUE,,TADLEY,HANTS,,RG26 4ER,Tel: 0118 981 1984, - ,,,5 ratings Rate it yourself - /Services/pharmacies/LeaveReview/DefaultView.aspx?id=FVJ17,,,,Yes,yes,yes
Kamsons Pharmacy,FJX48,PHA,97 Liscombe,Birch Hill,Bracknell,Berkshire,,RG12 7DE,Tel: 01344 423828, - ,,,4 ratings Rate it yourself - /Services/pharmacies/LeaveReview/DefaultView.aspx?id=FJX48,,,,Yes,yes,
TESCO INSTORE PHARMACY,FJ783,PHA,JIGS LANE,,WARFIELD,BERKSHIRE,,RG42 3JP,Tel: 01344 320042, - ,,,69 ratings Rate it yourself - /Services/pharmacies/LeaveReview/DefaultView.aspx?id=FJ783,,,,Yes,yes,yes
Boots,FM294,PHA,70 YORKTOWN ROAD, ,SANDHURST,BERKSHIRE,,GU47 9BT,Tel: 01252873164, - ,,,No ratings yet Rate it yourself - /Services/pharmacies/LeaveReview/DefaultView.aspx?id=FM294,0,0,,Yes,yes,yes
Bullbrook Pharmacy,FWJ29,PHA,3 BULLBROOK ROW,BRACKNELL,BERKSHIRE,,,RG12 2NL,Tel: 01344 454012, - ,,,15 ratings Rate it yourself - /Services/pharmacies/LeaveReview/DefaultView.aspx?id=FWJ29,,,,Yes,yes,yes
Morland Pharmacy,FN444,PHA,40 NEW ROAD,TADLEY,HAMPSHIRE,,,RG26 3AN,Tel: 0118 982 0157, - ,,,4 ratings Rate it yourself - /Services/pharmacies/LeaveReview/DefaultView.aspx?id=FN444,,,,Yes,yes,yes
WELLBEING PHARMACY,FTT94,PHA,74 HIGH STREET,HARTLEY WINTNEY,,HAMPSHIRE,,RG27 8NY,Tel: 01252 842449, - ,,,No ratings yet Rate it yourself - /Services/pharmacies/LeaveReview/DefaultView.aspx?id=FTT94,0,0,,Yes,yes,
Altwood Pharmacy,FFA41,PHA,47 WOOTTON WAY,,MAIDENHEAD,BERKSHIRE,,SL6 4QZ,Tel: 01628 630283        , - ,,,3 ratings Rate it yourself - /Services/pharmacies/LeaveReview/DefaultView.aspx?id=FFA41,,,,Yes,yes,yes
Boots,FDL72,PHA,5 THE SQUARE,HARMANSWATER,BRACKNELL,BERKSHIRE,,RG12 9LP,Tel: 01344425599, - ,,,3 ratings Rate it yourself - /Services/pharmacies/LeaveReview/DefaultView.aspx?id=FDL72,,,,Yes,yes,yes
H A MCPARLAND LTD,FG167,PHA,27 YEOVIL ROAD,OWLSMOOR,SANDHURST,SURREY,,GU47 0TF,Tel: 01344 775743, - ,,,No ratings yet Rate it yourself - /Services/pharmacies/LeaveReview/DefaultView.aspx?id=FG167,0,0,,Yes,yes,yes
Olive Pharmacy,FVJ57,PHA,18 HAMPDEN ROAD,,MAIDENHEAD,BERKSHIRE,,SL6 5HQ,Tel: 01628 622872, - ,,,4 ratings Rate it yourself - /Services/pharmacies/LeaveReview/DefaultView.aspx?id=FVJ57,,,,Yes,yes,yes
Darby Green Pharmacy,FVP59,PHA,3 KINGFISHER PARADE,"ROSEMARY LANE, BLACKWATER",NR CAMBERLEY,SURREY,,GU17 0LL,Tel: 01252 870685, - ,,,6 ratings Rate it yourself - /Services/pharmacies/LeaveReview/DefaultView.aspx?id=FVP59,,,,Yes,yes,
Kays Chemist,FWR11,PHA,24 ROSS ROAD,,MAIDENHEAD,BERKSHIRE,,SL6 2SZ,Tel: 01628 770687        , - ,,,4 ratings Rate it yourself - /Services/pharmacies/LeaveReview/DefaultView.aspx?id=FWR11,,,,Yes,yes,yes
Keycircle Pharmacy,FY750,PHA,SYMONS MEDICAL CENTRE,25 ALL SAINTS AVENUE,MAIDENHEAD,BERKSHIRE,,SL6 6EL,Tel: 01628781335, - ,,,3 ratings Rate it yourself - /Services/pharmacies/LeaveReview/DefaultView.aspx?id=FY750,,,,Yes,yes,Data not available
CHINEHAM PHARMACY,FJR71,PHA,34 GUINEA COURT,CHINEHAM NORTH,BASINGSTOKE,HAMPSHIRE,,RG24 8XJ,Tel: 01256 479338, - ,,,2 ratings Rate it yourself - /Services/pharmacies/LeaveReview/DefaultView.aspx?id=FJR71,,,,Yes,yes,
Whitewater Pharmacy,FGF50,PHA,READING ROAD,,HOOK,HAMPSHIRE,,RG27 9ED,Tel: 01256 760699, - ,,,16 ratings Rate it yourself - /Services/pharmacies/LeaveReview/DefaultView.aspx?id=FGF50,,,,Yes,yes,
TESCO INSTORE PHARMACY,FE003,PHA,"TESCO EXTRA, THE MEADOWS",MARSHALL ROAD,SANDHURST,BERKSHIRE,,GU47 0FD,Tel: 01172915649, - ,,,No ratings yet Rate it yourself - /Services/pharmacies/LeaveReview/DefaultView.aspx?id=FE003,0,0,,Yes,yes,yes
DAY LEWIS PHARMACY,FQJ14,PHA,3 Stompits Road,Holyport,Maidenhead,Berkshire,,SL6 2LA,Tel: 01628629216, - ,,,No ratings yet Rate it yourself - /Services/pharmacies/LeaveReview/DefaultView.aspx?id=FQJ14,0,0,,Yes,yes,yes
ALLIED PHARMACY CHOLSEY,FPH57,PHA,1 THE POUND,CHOLSEY,WALLINGFORD,OXFORDSHIRE,,OX10 9NS,Tel: 01491 652392, - ,,,No ratings yet Rate it yourself - /Services/pharmacies/LeaveReview/DefaultView.aspx?id=FPH57,0,0,,Yes,yes,
Marlow Pharmacy,FTX36,PHA,61 HIGH STREET,,MARLOW,BUCKINGHAMSHIRE,,SL7 1AB,Tel: 01628 482241        , - ,,,1 rating Rate it yourself - /Services/pharmacies/LeaveReview/DefaultView.aspx?id=FTX36,,,,Yes,yes,yes
Superdrug Pharmacy,FL069,PHA,36-38 Brock Lane Mall,Nicholsons Centre,Maidenhead,Berkshire,,SL6 1LL,Tel: 01628 623246, - ,,,No ratings yet Rate it yourself - /Services/pharmacies/LeaveReview/DefaultView.aspx?id=FL069,0,0,,Yes,yes,no
Boots,FP349,PHA,4-5 MARKET SQUARE,MARLOW,BUCKINGHAMSHIRE, ,,SL7 3HH,Tel: 01628482875, - ,,,1 rating Rate it yourself - /Services/pharmacies/LeaveReview/DefaultView.aspx?id=FP349,,,,Yes,yes,no
Blackwater Pharmacy,FJ127,PHA,40 London Road,Blackwater,Camberley,Surrey,,GU17 9AA,Tel: 01276 32227, - ,,,23 ratings Rate it yourself - /Services/pharmacies/LeaveReview/DefaultView.aspx?id=FJ127,,,,Yes,yes,
Boots,FLE32,PHA,54-58 HIGH STREET,MAIDENHEAD,BERKSHIRE, ,,SL6 1PY,Tel: 01628671834, - ,,,1 rating Rate it yourself - /Services/pharmacies/LeaveReview/DefaultView.aspx?id=FLE32,,,,Yes,yes,no
Boots,FEW25,PHA,2-3 THE HOOK PARADE,STATION ROAD,HOOK,HAMPSHIRE,,RG27 9HB,Tel: 01256762497, - ,,,No ratings yet Rate it yourself - /Services/pharmacies/LeaveReview/DefaultView.aspx?id=FEW25,0,0,,Yes,yes,yes
H A MCPARLAND LTD,FFD76,PHA,9 SHIFFORD CRESCENT,,MAIDENHEAD,BERKSHIRE,,SL6 7UA,Tel: 01628 781817, - ,,,1 rating Rate it yourself - /Services/pharmacies/LeaveReview/DefaultView.aspx?id=FFD76,,,,Yes,yes,yes
PARK PHARMACY,FQ620,PHA,4 COOKHAM ROAD,MAIDENHEAD,BERKSHIRE, ,,SL6 8AJ,Tel: 01628628277, - ,,,1 rating Rate it yourself - /Services/pharmacies/LeaveReview/DefaultView.aspx?id=FQ620,,,,Yes,yes,yes
Glade Pharmacy,FVT83,PHA,VICTORIA ROAD,MARLOW,BUCKINGHAMSHIRE, ,,SL7 1DS,Tel: 01628482078, - ,,,26 ratings Rate it yourself - /Services/pharmacies/LeaveReview/DefaultView.aspx?id=FVT83,,,,Yes,yes,yes
Morrisons Pharmacy,FWA74,PHA,"THE KEY, ELVETHAM HEATH",ELVETHAM HEATH WAY,FLEET,HAMPSHIRE,,GU51 1HA,Tel: 01252 625821, - ,,,5 ratings Rate it yourself - /Services/pharmacies/LeaveReview/DefaultView.aspx?id=FWA74,,,,Yes,yes,yes
Bridge Pharmacy,FAE57,PHA,119 BRIDGE ROAD,MAIDENHEAD,BERKSHIRE, ,,SL6 8NA,Tel: 01628 623125, - ,,,No ratings yet Rate it yourself - /Services/pharmacies/LeaveReview/DefaultView.aspx?id=FAE57,0,0,,Yes,yes,yes
Boots,FT608,PHA,7/8 MARKET PLACE,WALLINGFORD,OXFORDSHIRE, ,,OX10 0EG,Tel: 01491839061, - ,,,1 rating Rate it yourself - /Services/pharmacies/LeaveReview/DefaultView.aspx?id=FT608,,,,Yes,yes,no
Boots,FAW77,PHA,CHINEHAM SHOPPING CENTRE,CHINEHAM,BASINGSTOKE,,,RG24 8BQ,Tel: 01256471414, - ,,,4 ratings Rate it yourself - /Services/pharmacies/LeaveReview/DefaultView.aspx?id=FAW77,,,,Yes,yes,yes
TESCO INSTORE PHARMACY,FPM84,PHA,DISTRICT SHOPPING CENTRE,CHINEHAM,BASINGSTOKE,HAMPSHIRE,,RG24 8BE,Tel: 01256 824104, - ,,,4 ratings Rate it yourself - /Services/pharmacies/LeaveReview/DefaultView.aspx?id=FPM84,,,,Yes,yes,yes
SUPERDRUG PHARMACY,FC693,PHA,6-12 PRINCE OF WALES WALK,,CAMBERLEY,SURREY,,GU15 3SJ,Tel: 01276 28474         , - ,,,No ratings yet Rate it yourself - /Services/pharmacies/LeaveReview/DefaultView.aspx?id=FC693,0,0,,Yes,yes,no
Boots,FNC00,PHA,26-30 OBELISK WAY,CAMBERLEY,SURREY, ,,GU15 3SD,Tel: 01276691006, - ,,,1 rating Rate it yourself - /Services/pharmacies/LeaveReview/DefaultView.aspx?id=FNC00,,,,Yes,yes,no
FLEET PHARMACY,FF312,PHA,FLEET MEDICAL CENTRE,CHURCH ROAD,FLEET,HAMPSHIRE,,GU51 4PE,Tel: 01252 612613, - ,,,No ratings yet Rate it yourself - /Services/pharmacies/LeaveReview/DefaultView.aspx?id=FF312,0,0,,Yes,yes,
Marlow Bottom Pharmacy,FQJ75,PHA,2 BRUCEWOOD PARADE,MARLOW BOTTOM,,BUCKINGHAMSHIRE,,SL7 3PE,Tel: 01628 486312        , - ,,,19 ratings Rate it yourself - /Services/pharmacies/LeaveReview/DefaultView.aspx?id=FQJ75,,,,Yes,yes,yes
David Pharmacy,FK742,PHA,24 NEW ROAD,ASCOT,BERKSHIRE, ,,SL5 8QQ,Tel: 01344 882399, - ,,,6 ratings Rate it yourself - /Services/pharmacies/LeaveReview/DefaultView.aspx?id=FK742,,,,Yes,yes,yes
Vsm Pharmacy,FMG78,PHA,124 Frimley Road,,Camberley,Surrey,,GU15 2QN,Tel: 01276 21002, - ,,,2 ratings Rate it yourself - /Services/pharmacies/LeaveReview/DefaultView.aspx?id=FMG78,,,,Yes,yes,yes